{"text_format":"3","workbook":"xlsx","n_sheets":9,"sheets":["Módulos","Jan-Abr 2025","Mai-Ago 2025","Set-Dez 2025","Jan-Abr 2026","Mai-Ago 2026","Set-Dez 2026","Jan-Abr 2027","Mai-Ago 2027"],"not_rendered":{"images":1,"macros":1,"defined_names":10},"read":"whole","date_system":"1900"}

{"sheet":"Módulos","index":0,"n_rows":86,"n_cols":111,"rows_kept":86}
[null,1,{"$f":"B1+1","v":2},3,4,5,6,7,8,{"$f":"I1+1","v":9},10,11,12,13,14,15,16,17,18,19,20,21,22,23,24,25,26,27,28,29,30,31,32,33,34,35,36,37,38,39,40,41,42,43,44,45,46,47,48,49,50,51,52,53,54,55,56,57,58,59,60,61,62,63,64,65,{"$f":"BN1+1","v":66},67,68,69,70,71,72,73,74,75,76,77,78,79,80,81,82,83,84,85,86,87,88,89,90,91,92,93,94,95,96,97,98,99,{"$f":"CV1+1","v":100},{"$f":"CW1+1","v":101},{"$f":"CX1+1","v":102},{"$f":"CY1+1","v":103},{"$f":"CZ1+1","v":104},{"$f":"DA1+1","v":105},{"$f":"DB1+1","v":106},{"$f":"DC1+1","v":107},{"$f":"DD1+1","v":108}]
[null,"2020-01-04",{"$f":"B2+7","v":"2020-01-11"},"2020-01-18","2020-01-25","2020-02-01","2020-02-08","2020-02-15","2020-02-22",{"$f":"I2+7","v":"2020-02-29"},"2020-03-07","2020-03-14","2020-03-21","2020-03-28","2020-04-04","2020-04-11","2020-04-18","2020-04-25","2020-05-02","2020-05-09","2020-05-16","2020-05-23","2020-05-30","2020-06-06","2020-06-13","2020-06-20","2020-06-27","2020-07-04","2020-07-11","2020-07-18","2020-07-25","2020-08-01","2020-08-08","2020-08-15","2020-08-22","2020-08-29","2020-09-05","2020-09-12","2020-09-19","2020-09-26","2020-10-03","2020-10-10","2020-10-17","2020-10-24","2020-10-31","2020-11-07","2020-11-14","2020-11-21","2020-11-28","2020-12-05","2020-12-12","2020-12-19","2020-12-26","2021-01-02","2021-01-09","2021-01-16","2021-01-23","2021-01-30","2021-02-06","2021-02-13","2021-02-20","2021-02-27","2021-03-06","2021-03-13","2021-03-20","2021-03-27",{"$f":"BN2+7","v":"2021-04-03"},"2021-04-10","2021-04-17","2021-04-24","2021-05-01","2021-05-08","2021-05-15","2021-05-22","2021-05-29","2021-06-05","2021-06-12","2021-06-19","2021-06-26","2021-07-03","2021-07-10","2021-07-17","2021-07-24","2021-07-31","2021-08-07","2021-08-14","2021-08-21","2021-08-28","2021-09-04","2021-09-11","2021-09-18","2021-09-25","2021-10-02","2021-10-09","2021-10-16","2021-10-23","2021-10-30","2021-11-06","2021-11-13","2021-11-20","2021-11-27","2021-12-04","2021-12-11","2021-12-18","2021-12-25","2022-01-01","2022-01-08","2022-01-15","2022-01-22"]
["LP1",{"$nulls":108},{"$f":"SUM(B3:DE3)","v":0},25]
["LP2",{"$nulls":108},0,40]
["LP3",{"$nulls":108},0,30]
["LP4",{"$nulls":108},0,30]
["LP5",{"$nulls":108},0,27]
["LP6",{"$nulls":108},0,20]
["LP7",{"$nulls":108},0,20]
["LE1",{"$nulls":108},0,42]
["LE2",{"$nulls":108},0,46]
["LE3",{"$nulls":108},0,50]
["LE4",{"$nulls":108},0,54]
["MA01",{"$nulls":108},0,16]
["MA02",{"$nulls":108},0,16]
["MA03",{"$nulls":108},0,16]
["MA04",{"$nulls":108},0,16]
["MA05",{"$nulls":108},0,16]
["MA06",{"$nulls":108},0,16]
["MA07",{"$nulls":108},0,16]
["MA08",{"$nulls":108},0,16]
["MA09",{"$nulls":108},0,16]
["MA10",{"$nulls":108},0,16]
["MA11",{"$nulls":108},0,16]
["MA12",{"$nulls":108},0,16]
["TIC1",{"$nulls":108},0,20]
["TIC2",{"$nulls":108},0,20]
["TIC3",{"$nulls":108},0,20]
["TIC4",{"$nulls":108},0,20]
["TIC5",{"$nulls":108},0,16]
["HST1",{"$nulls":108},0,18]
["HST2",{"$nulls":108},0,12]
["EF1",{"$nulls":108},0,44]
["EF2",{"$nulls":108},0,20]
["EF3",{"$nulls":108},{"$f":"SUM(B35:DE35)","v":0},32]
["MA1",{"$nulls":108},0,25]
["MA2",{"$nulls":108},0,30]
["MA3",{"$nulls":108},0,25]
["MA4",{"$nulls":108},0,25]
["MA5",{"$nulls":108},0,25]
["MA6",{"$nulls":108},0,30]
["MA7",{"$nulls":108},0,25]
["MA8",{"$nulls":108},0,25]
["FQ1",{"$nulls":108},0,10]
["FQ2",{"$nulls":108},0,13]
["FQ3",{"$nulls":108},0,15]
["FQ4",{"$nulls":108},0,15]
["FQ5",{"$nulls":108},0,15]
["FQ6",{"$nulls":108},0,10]
["FQ7",{"$nulls":108},0,15]
["FQ8",{"$nulls":108},0,15]
["FQ9",{"$nulls":108},0,15]
["DT1",{"$nulls":108},0,50]
["TMM",{"$nulls":108},0,25]
["MD",{"$nulls":108},0,25]
["CMB",{"$nulls":108},0,25]
["DT2",{"$nulls":108},0,50]
["HST",{"$nulls":108},0,25]
["CMS",{"$nulls":108},0,25]
["TSF",{"$nulls":108},0,25]
["TSC",{"$nulls":108},0,50]
["TSP",{"$nulls":108},0,25]
["DT3",{"$nulls":108},0,25]
["SER1",{"$nulls":108},0,50]
["SER2",{"$nulls":108},0,50]
["SER3",{"$nulls":108},0,50]
["MAG1",{"$nulls":108},0,50]
["MAG2",{"$nulls":108},0,50]
["MAG3",{"$nulls":108},0,50]
["MAG4",{"$nulls":108},0,50]
["TIG1",{"$nulls":108},0,50]
["TIG2",{"$nulls":108},0,50]
["SER4",{"$nulls":108},0,50]
["SER5",{"$nulls":108},0,25]
["SER6",{"$nulls":108},0,50]
["MAG5",{"$nulls":108},0,50]
["MAG6",{"$nulls":108},0,25]
["AP",{"$nulls":108},0,90]
["SALP",{"$nulls":108},0]
["SAMA",{"$nulls":108},0]
["PCT",{"$nulls":108},0,210]
["PAF",{"$nulls":108},0,25]
[null,{"$f":"SUM(B3:B82)","v":0},0,0,0,0,0,0,0,0,0,0,0,0,0,0,0,0,0,0,0,0,0,0,0,0,0,0,0,0,0,0,0,0,0,0,0,0,0,0,0,0,0,0,0,0,0,0,0,0,0,0,0,0,0,0,0,0,0,0,0,0,0,0,0,{"$f":"SUM(BN3:BN82)","v":0},0,0,0,0,0,0,0,0,0,0,0,0,0,0,0,0,0,0,0,0,0,0,0,0,0,0,0,0,0,0,0,0,0,0,0,0,0,0,0,0,0,0,0]
[30,{"$f":"$A$84","v":30},30,30,30,30,30,30,30,30,30,30,30,30,30,30,30,30,30,30,30,30,30,30,30,30,30,30,30,30,30,30,30,30,30,30,30,30,30,30,30,30,30,30,30,30,30,30,30,30,30,30,30,30,30,30,30,30,30,30,30,30,30,30,30,{"$f":"$A$84","v":30},30,30,30,30,30,30,30,30,30,30,30,30,30,30,30,30,30,30,30,30,30,30,30,30,30,30,30,30,30,30,30,30,30,30,30,30,30,30,30,30,30,30,30]
[35,{"$f":"$A$85","v":35},35,35,35,35,35,35,35,35,35,35,35,35,35,35,35,35,35,35,35,35,35,35,35,35,35,35,35,35,35,35,35,35,35,35,35,35,35,35,35,35,35,35,35,35,35,35,35,35,35,35,35,35,35,35,35,35,35,35,35,35,35,35,35,{"$f":"$A$85","v":35},35,35,35,35,35,35,35,35,35,35,35,35,35,35,35,35,35,35,35,35,35,35,35,35,35,35,35,35,35,35,35,35,35,35,35,35,35,35,35,35,35,35,35]
[40,{"$f":"$A$86","v":40},40,40,40,40,40,40,40,40,40,40,40,40,40,40,40,40,40,40,40,40,40,40,40,40,40,40,40,40,40,40,40,40,40,40,40,40,40,40,40,40,40,40,40,40,40,40,40,40,40,40,40,40,40,40,40,40,40,40,40,40,40,40,40,{"$f":"$A$86","v":40},40,40,40,40,40,40,40,40,40,40,40,40,40,40,40,40,40,40,40,40,40,40,40,40,40,40,40,40,40,40,40,40,40,40,40,40,40,40,40,40,40,40,40]

{"sheet":"Jan-Abr 2025","index":1,"n_rows":77,"n_cols":107,"rows_kept":77,"merged":[[0,25,0,32],[0,34,2,39],[0,40,6,40],[0,41,6,41],[0,42,6,42],[0,43,6,43],[0,44,6,44],[0,45,6,45],[0,46,6,46],[0,48,2,53],[0,54,6,54],[0,55,6,55],[0,56,6,56],[0,57,6,57],[0,58,6,58],[0,59,6,59],[0,60,6,60],[0,62,2,67],[0,68,6,68],[0,69,6,69],[0,70,6,70],[0,71,6,71],[0,72,6,72],[0,73,6,73],[0,74,6,74],[0,105,6,105],[0,106,6,106],[1,25,1,32],[2,25,2,32],[3,25,3,32],[3,34,6,34],[3,35,6,35],[3,36,6,36],[3,37,6,37],[3,38,6,38],[3,39,6,39],[3,48,6,48],[3,49,6,49],[3,50,6,50],[3,51,6,51],[3,52,6,52],[3,53,6,53],[3,62,6,62],[3,63,6,63],[3,64,6,64],[3,65,6,65],[3,66,6,66],[3,67,6,67],[4,0,4,2],[4,3,4,9],[4,10,4,13],[4,14,4,21],[4,22,4,26],[4,27,4,29],[4,30,4,32],[5,0,5,2],[5,3,5,9],[5,10,5,13],[5,14,5,21],[5,22,5,26],[5,27,5,29],[5,30,5,32],[6,0,6,2],[6,3,6,9],[6,10,6,13],[6,14,6,21],[6,22,6,26],[6,27,6,29],[6,30,6,32],[7,0,8,1],[9,0,9,1],[10,0,10,1],[11,0,11,1],[12,0,12,1],[14,0,14,1],[15,0,15,1],[16,0,16,1],[17,0,17,1],[19,0,20,1],[21,0,21,1],[22,0,22,1],[23,0,23,1],[24,0,24,1],[25,0,25,1],[26,0,26,1],[27,0,27,1],[28,0,28,1],[29,0,29,1],[31,0,32,1],[33,0,33,1],[34,0,34,1],[35,0,35,1],[36,0,36,1],[37,0,37,1],[38,0,38,1],[39,0,39,1],[40,0,40,1],[41,0,41,1],[43,0,44,1],[45,0,45,1],[46,0,46,1],[47,0,47,1],[48,0,48,1],[49,0,49,1],[50,0,50,1],[51,0,51,1],[52,0,52,1],[53,0,53,1],[54,2,54,8],[54,11,54,13],[54,17,54,19],[54,20,54,25],[54,28,54,30],[55,0,60,0],[55,3,55,8],[55,11,55,13],[55,17,63,17],[55,20,55,25],[55,28,55,30],[56,3,56,8],[56,11,56,13],[56,20,56,25],[56,28,56,30],[57,3,57,8],[57,11,57,13],[57,20,57,25],[57,28,57,30],[58,3,58,8],[58,11,58,13],[58,20,58,25],[58,28,58,30],[59,3,59,8],[59,11,59,13],[59,20,59,25],[59,28,59,30],[60,3,60,8],[60,11,60,13],[60,20,60,25],[60,28,60,30],[61,20,61,25],[61,28,61,30],[62,20,62,25],[63,0,73,0],[63,3,63,8],[63,11,63,13],[63,20,63,25],[64,3,64,8],[64,11,64,13],[65,3,65,8],[65,11,65,13],[66,3,66,8],[66,11,66,13],[67,3,67,8],[67,11,67,13],[68,3,68,8],[68,11,68,13],[69,3,69,8],[69,11,69,13],[70,3,70,8],[70,11,70,13],[71,3,71,8],[71,11,71,13],[72,3,72,8],[72,11,72,13],[73,3,73,8],[73,11,73,13],[75,34,75,35],[76,2,76,3],[76,4,76,5],[76,6,76,7],[76,8,76,9],[76,10,76,11],[76,12,76,13]]}
[{"$nulls":40},{"$f":"TEXT($A$8,\"mmm\")","v":"jan"},{"$f":"TEXT($A$20,\"mmm\")","v":"fev"},{"$f":"TEXT($A$32,\"mmm\")","v":"mar"},{"$f":"TEXT($A$44,\"mmm\")","v":"abr"},"Total  Folha","Total Global","Total  Acum.",{"$nulls":7},{"$f":"TEXT($A$8,\"mmm\")","v":"jan"},{"$f":"TEXT($A$20,\"mmm\")","v":"fev"},{"$f":"TEXT($A$32,\"mmm\")","v":"mar"},{"$f":"TEXT($A$44,\"mmm\")","v":"abr"},"Total  Folha","Total Global","Total  Acum.",{"$nulls":7},{"$f":"TEXT($A$8,\"mmm\")","v":"jan"},{"$f":"TEXT($A$20,\"mmm\")","v":"fev"},{"$f":"TEXT($A$32,\"mmm\")","v":"mar"},{"$f":"TEXT($A$44,\"mmm\")","v":"abr"},"Total  Folha","Total Global","Total  Acum.",{"$nulls":30},"tipo_soma","tipo_contador"]
[{"$nulls":25},"Director(a):"]
[{"$nulls":25},"(Cristina Botas)"]
[{"$nulls":34},"Tipo","Módulo","ST","Origem","Cálculo","Objetivo",{"$nulls":8},"Tipo","Módulo",{"$f":"AK4","v":"ST"},"Origem","Cálculo","Objetivo",{"$nulls":8},"Tipo","Módulo",{"$f":"AK4","v":"ST"},"Origem","Cálculo","Objetivo"]
["MODALIDADE:",{"$nulls":9},"CODÍGO DA AÇÃO:",{"$nulls":16},"       U.O.:",null,null,"Torres Vedras"]
["PLANEAMENTO:",{"$nulls":9},"SAÍDA PROFISSIONAL: Técnico/a Especialista em Mecatrónica",{"$nulls":16},"DATA INÍCIO:"]
["COORDENADOR:",{"$nulls":9},"DURAÇÃO:",{"$nulls":16},"DATA FIM  (previsto):"]
["2025-01-01",null,{"$f":"IF(C9<>\"\",CHOOSE(WEEKDAY(C9,1),\"Dom.\",\"Seg.\",\"Ter.\",\"Qua.\",\"Qui.\",\"Sex.\",\"Sáb.\"),\"\")","v":"Qua."},{"$f":"IF(D9<>\"\",CHOOSE(WEEKDAY(D9,1),\"Dom.\",\"Seg.\",\"Ter.\",\"Qua.\",\"Qui.\",\"Sex.\",\"Sáb.\"),\"\")","v":"Qui."},"Sex.","Sáb.","Dom.","Seg.","Ter.","Qua.","Qui.","Sex.","Sáb.","Dom.","Seg.","Ter.","Qua.","Qui.","Sex.","Sáb.","Dom.","Seg.","Ter.","Qua.","Qui.","Sex.","Sáb.","Dom.","Seg.","Ter.","Qua.","Qui.","Sex.",null,null,"IGO",{"$f":"IF(AI8=$DC$8,AM8,IF(AI8=$DC$9,AM8,IF(AI8=$DC$10,AL8,)))","v":0},{"$f":"IF($AK$4=$DB$8,AS8,IF($AK$4=$DB$9,AT8,IF($AK$4=$DB$10,AU8,IF($AK$4=$DB$11,AO8,IF($AK$4=$DB$12,AP8,IF($AK$4=$DB$13,AQ8,IF($AK$4=$DB$14,AR8,\"\")))))))","v":0},{"$f":"IF(AI8=$DC$8,AL8,IF(AI8=$DC$9,AM9+AL8,IF(AI8=$DC$10,IF(AI9=$DC$10,AM9+AL8,AL8),)))","v":0},25,{"$f":"COUNTIF($C$10:$AG$18,$AJ8)","v":0},{"$f":"COUNTIF($C$22:$AG$30,$AJ8)","v":0},{"$f":"COUNTIF($C$34:$AG$42,$AJ8)","v":0},{"$f":"COUNTIF($C$46:$AG$54,$AJ8)","v":0},{"$f":"SUM(AO8:AR8)","v":0},{"$f":"'Jan-Abr 2025'!AS8+'Mai-Ago 2025'!AS8+'Set-Dez 2025'!AS8+'Jan-Abr 2026'!AS8+'Mai-Ago 2026'!AS8+'Set-Dez 2026'!AS8+'Jan-Abr 2027'!AS8+'Mai-Ago 2027'!AS8","v":0},{"$f":"'Jan-Abr 2025'!AS8","v":0},{"$nulls":3},{"$f":"IF(AW8=$DC$8,BA8,IF(AW8=$DC$9,BA8,IF(AW8=$DC$10,AZ8,)))","v":0},{"$f":"IF($AK$4=$DB$8,BG8,IF($AK$4=$DB$9,BH8,IF($AK$4=$DB$10,BI8,IF($AK$4=$DB$11,BC8,IF($AK$4=$DB$12,BD8,IF($AK$4=$DB$13,BE8,IF($AK$4=$DB$14,BF8,\"\")))))))","v":0},{"$f":"IF(AW8=$DC$8,AZ8,IF(AW8=$DC$9,BA9+AZ8,IF(AW8=$DC$10,IF(AW9=$DC$10,BA9+AZ8,AZ8),)))","v":0},null,{"$f":"COUNTIF($C$10:$AG$18,$AX8)","v":0},{"$f":"COUNTIF($C$22:$AG$30,$AX8)","v":0},{"$f":"COUNTIF($C$34:$AG$42,$AX8)","v":0},{"$f":"COUNTIF($C$46:$AG$54,$AX8)","v":0},{"$f":"SUM(BC8:BF8)","v":0},{"$f":"'Jan-Abr 2025'!BG8+'Mai-Ago 2025'!BG8+'Set-Dez 2025'!BG8+'Jan-Abr 2026'!BG8+'Mai-Ago 2026'!BG8+'Set-Dez 2026'!BG8+'Jan-Abr 2027'!BG8+'Mai-Ago 2027'!BG8","v":0},{"$f":"'Jan-Abr 2025'!BG8","v":0},{"$nulls":3},{"$f":"IF(BK8=$DC$8,BO8,IF(BK8=$DC$9,BO8,IF(BK8=$DC$10,BN8,)))","v":0},{"$f":"IF($AK$4=$DB$8,BU8,IF($AK$4=$DB$9,BV8,IF($AK$4=$DB$10,BW8,IF($AK$4=$DB$11,BQ8,IF($AK$4=$DB$12,BR8,IF($AK$4=$DB$13,BS8,IF($AK$4=$DB$14,BT8,\"\")))))))","v":0},{"$f":"IF(BK8=$DC$8,BN8,IF(BK8=$DC$9,BO9+BN8,IF(BK8=$DC$10,IF(BK9=$DC$10,BO9+BN8,BN8),)))","v":0},null,{"$f":"COUNTIF($C$10:$AG$18,$BL8)","v":0},{"$f":"COUNTIF($C$22:$AG$30,$BL8)","v":0},{"$f":"COUNTIF($C$34:$AG$42,$BL8)","v":0},{"$f":"COUNTIF($C$46:$AG$54,$BL8)","v":0},{"$f":"SUM(BQ8:BT8)","v":0},{"$f":"'Jan-Abr 2025'!BU8+'Mai-Ago 2025'!BU8+'Set-Dez 2025'!BU8+'Jan-Abr 2026'!BU8+'Mai-Ago 2026'!BU8+'Set-Dez 2026'!BU8+'Jan-Abr 2027'!BU8+'Mai-Ago 2027'!BU8","v":0},{"$f":"'Jan-Abr 2025'!BU8","v":0},{"$nulls":30},"SF","M"]
[null,null,{"$f":"A8","v":"2025-01-01"},{"$f":"IF(C9=\"\",\"\",IF(DAY(C9)<DAY(EOMONTH(C9,0)),C9+1,\"\"))","v":"2025-01-02"},{"$f":"IF(D9=\"\",\"\",IF(DAY(D9)<DAY(EOMONTH(D9,0)),D9+1,\"\"))","v":"2025-01-03"},"2025-01-04","2025-01-05","2025-01-06","2025-01-07","2025-01-08",{"$f":"IF(J9=\"\",\"\",IF(DAY(J9)<DAY(EOMONTH(J9,0)),J9+1,\"\"))","v":"2025-01-09"},{"$f":"IF(K9=\"\",\"\",IF(DAY(K9)<DAY(EOMONTH(K9,0)),K9+1,\"\"))","v":"2025-01-10"},"2025-01-11","2025-01-12","2025-01-13","2025-01-14","2025-01-15",{"$f":"IF(Q9=\"\",\"\",IF(DAY(Q9)<DAY(EOMONTH(Q9,0)),Q9+1,\"\"))","v":"2025-01-16"},{"$f":"IF(R9=\"\",\"\",IF(DAY(R9)<DAY(EOMONTH(R9,0)),R9+1,\"\"))","v":"2025-01-17"},"2025-01-18","2025-01-19","2025-01-20","2025-01-21","2025-01-22",{"$f":"IF(X9=\"\",\"\",IF(DAY(X9)<DAY(EOMONTH(X9,0)),X9+1,\"\"))","v":"2025-01-23"},{"$f":"IF(Y9=\"\",\"\",IF(DAY(Y9)<DAY(EOMONTH(Y9,0)),Y9+1,\"\"))","v":"2025-01-24"},"2025-01-25","2025-01-26","2025-01-27","2025-01-28","2025-01-29",{"$f":"IF(AE9=\"\",\"\",IF(DAY(AE9)<DAY(EOMONTH(AE9,0)),AE9+1,\"\"))","v":"2025-01-30"},{"$f":"IF(AF9=\"\",\"\",IF(DAY(AF9)<DAY(EOMONTH(AF9,0)),AF9+1,\"\"))","v":"2025-01-31"},null,null,"GMQ",0,{"$f":"IF($AK$4=$DB$8,AS9,IF($AK$4=$DB$9,AT9,IF($AK$4=$DB$10,AU9,IF($AK$4=$DB$11,AO9,IF($AK$4=$DB$12,AP9,IF($AK$4=$DB$13,AQ9,IF($AK$4=$DB$14,AR9,\"\")))))))","v":0},0,25,{"$f":"COUNTIF($C$10:$AG$18,$AJ9)","v":0},{"$f":"COUNTIF($C$22:$AG$30,$AJ9)","v":0},{"$f":"COUNTIF($C$34:$AG$42,$AJ9)","v":0},{"$f":"COUNTIF($C$46:$AG$54,$AJ9)","v":0},0,{"$f":"'Jan-Abr 2025'!AS9+'Mai-Ago 2025'!AS9+'Set-Dez 2025'!AS9+'Jan-Abr 2026'!AS9+'Mai-Ago 2026'!AS9+'Set-Dez 2026'!AS9+'Jan-Abr 2027'!AS9+'Mai-Ago 2027'!AS9","v":0},{"$f":"'Jan-Abr 2025'!AS9","v":0},{"$nulls":3},0,{"$f":"IF($AK$4=$DB$8,BG9,IF($AK$4=$DB$9,BH9,IF($AK$4=$DB$10,BI9,IF($AK$4=$DB$11,BC9,IF($AK$4=$DB$12,BD9,IF($AK$4=$DB$13,BE9,IF($AK$4=$DB$14,BF9,\"\")))))))","v":0},0,null,{"$f":"COUNTIF($C$10:$AG$18,$AX9)","v":0},{"$f":"COUNTIF($C$22:$AG$30,$AX9)","v":0},{"$f":"COUNTIF($C$34:$AG$42,$AX9)","v":0},{"$f":"COUNTIF($C$46:$AG$54,$AX9)","v":0},0,{"$f":"'Jan-Abr 2025'!BG9+'Mai-Ago 2025'!BG9+'Set-Dez 2025'!BG9+'Jan-Abr 2026'!BG9+'Mai-Ago 2026'!BG9+'Set-Dez 2026'!BG9+'Jan-Abr 2027'!BG9+'Mai-Ago 2027'!BG9","v":0},{"$f":"'Jan-Abr 2025'!BG9","v":0},{"$nulls":3},0,{"$f":"IF($AK$4=$DB$8,BU9,IF($AK$4=$DB$9,BV9,IF($AK$4=$DB$10,BW9,IF($AK$4=$DB$11,BQ9,IF($AK$4=$DB$12,BR9,IF($AK$4=$DB$13,BS9,IF($AK$4=$DB$14,BT9,\"\")))))))","v":0},0,null,{"$f":"COUNTIF($C$10:$AG$18,$BL9)","v":0},{"$f":"COUNTIF($C$22:$AG$30,$BL9)","v":0},{"$f":"COUNTIF($C$34:$AG$42,$BL9)","v":0},{"$f":"COUNTIF($C$46:$AG$54,$BL9)","v":0},0,{"$f":"'Jan-Abr 2025'!BU9+'Mai-Ago 2025'!BU9+'Set-Dez 2025'!BU9+'Jan-Abr 2026'!BU9+'Mai-Ago 2026'!BU9+'Set-Dez 2026'!BU9+'Jan-Abr 2027'!BU9+'Mai-Ago 2027'!BU9","v":0},{"$f":"'Jan-Abr 2025'!BU9","v":0},{"$nulls":30},"ST","T"]
["09h00 - 09h50",{"$nulls":34},"SGQ",0,0,0,25,0,0,0,0,0,{"$f":"'Jan-Abr 2025'!AS10+'Mai-Ago 2025'!AS10+'Set-Dez 2025'!AS10+'Jan-Abr 2026'!AS10+'Mai-Ago 2026'!AS10+'Set-Dez 2026'!AS10+'Jan-Abr 2027'!AS10+'Mai-Ago 2027'!AS10","v":0},{"$f":"'Jan-Abr 2025'!AS10","v":0},{"$nulls":3},0,0,0,null,0,0,0,0,0,{"$f":"'Jan-Abr 2025'!BG10+'Mai-Ago 2025'!BG10+'Set-Dez 2025'!BG10+'Jan-Abr 2026'!BG10+'Mai-Ago 2026'!BG10+'Set-Dez 2026'!BG10+'Jan-Abr 2027'!BG10+'Mai-Ago 2027'!BG10","v":0},{"$f":"'Jan-Abr 2025'!BG10","v":0},{"$nulls":3},0,0,0,null,0,0,0,0,0,{"$f":"'Jan-Abr 2025'!BU10+'Mai-Ago 2025'!BU10+'Set-Dez 2025'!BU10+'Jan-Abr 2026'!BU10+'Mai-Ago 2026'!BU10+'Set-Dez 2026'!BU10+'Jan-Abr 2027'!BU10+'Mai-Ago 2027'!BU10","v":0},{"$f":"'Jan-Abr 2025'!BU10","v":0},{"$nulls":30},"SA","P"]
["09h50 - 10h40",null,"Ano",{"$nulls":32},"ASHST",0,0,0,25,0,0,0,0,0,{"$f":"'Jan-Abr 2025'!AS11+'Mai-Ago 2025'!AS11+'Set-Dez 2025'!AS11+'Jan-Abr 2026'!AS11+'Mai-Ago 2026'!AS11+'Set-Dez 2026'!AS11+'Jan-Abr 2027'!AS11+'Mai-Ago 2027'!AS11","v":0},{"$f":"'Jan-Abr 2025'!AS11","v":0},{"$nulls":3},0,0,0,null,0,0,0,0,0,{"$f":"'Jan-Abr 2025'!BG11+'Mai-Ago 2025'!BG11+'Set-Dez 2025'!BG11+'Jan-Abr 2026'!BG11+'Mai-Ago 2026'!BG11+'Set-Dez 2026'!BG11+'Jan-Abr 2027'!BG11+'Mai-Ago 2027'!BG11","v":0},{"$f":"'Jan-Abr 2025'!BG11","v":0},{"$nulls":3},0,0,0,null,0,0,0,0,0,{"$f":"'Jan-Abr 2025'!BU11+'Mai-Ago 2025'!BU11+'Set-Dez 2025'!BU11+'Jan-Abr 2026'!BU11+'Mai-Ago 2026'!BU11+'Set-Dez 2026'!BU11+'Jan-Abr 2027'!BU11+'Mai-Ago 2027'!BU11","v":0},{"$f":"'Jan-Abr 2025'!BU11","v":0},{"$nulls":30},{"$f":"TEXT(A8,\"mmm\")","v":"jan"}]
["11h00 - 11h50",null,"Novo",{"$nulls":32},"DT",0,0,0,25,0,0,0,0,0,{"$f":"'Jan-Abr 2025'!AS12+'Mai-Ago 2025'!AS12+'Set-Dez 2025'!AS12+'Jan-Abr 2026'!AS12+'Mai-Ago 2026'!AS12+'Set-Dez 2026'!AS12+'Jan-Abr 2027'!AS12+'Mai-Ago 2027'!AS12","v":0},{"$f":"'Jan-Abr 2025'!AS12","v":0},{"$nulls":3},0,0,0,null,0,0,0,0,0,{"$f":"'Jan-Abr 2025'!BG12+'Mai-Ago 2025'!BG12+'Set-Dez 2025'!BG12+'Jan-Abr 2026'!BG12+'Mai-Ago 2026'!BG12+'Set-Dez 2026'!BG12+'Jan-Abr 2027'!BG12+'Mai-Ago 2027'!BG12","v":0},{"$f":"'Jan-Abr 2025'!BG12","v":0},{"$nulls":3},0,0,0,null,0,0,0,0,0,{"$f":"'Jan-Abr 2025'!BU12+'Mai-Ago 2025'!BU12+'Set-Dez 2025'!BU12+'Jan-Abr 2026'!BU12+'Mai-Ago 2026'!BU12+'Set-Dez 2026'!BU12+'Jan-Abr 2027'!BU12+'Mai-Ago 2027'!BU12","v":0},{"$f":"'Jan-Abr 2025'!BU12","v":0},{"$nulls":30},{"$f":"TEXT(A20,\"mmm\")","v":"fev"}]
["11h50 - 12h40",{"$nulls":34},"ICS",0,0,0,25,0,0,0,0,0,{"$f":"'Jan-Abr 2025'!AS13+'Mai-Ago 2025'!AS13+'Set-Dez 2025'!AS13+'Jan-Abr 2026'!AS13+'Mai-Ago 2026'!AS13+'Set-Dez 2026'!AS13+'Jan-Abr 2027'!AS13+'Mai-Ago 2027'!AS13","v":0},{"$f":"'Jan-Abr 2025'!AS13","v":0},{"$nulls":3},0,0,0,null,0,0,0,0,0,{"$f":"'Jan-Abr 2025'!BG13+'Mai-Ago 2025'!BG13+'Set-Dez 2025'!BG13+'Jan-Abr 2026'!BG13+'Mai-Ago 2026'!BG13+'Set-Dez 2026'!BG13+'Jan-Abr 2027'!BG13+'Mai-Ago 2027'!BG13","v":0},{"$f":"'Jan-Abr 2025'!BG13","v":0},{"$nulls":3},0,0,0,null,0,0,0,0,0,{"$f":"'Jan-Abr 2025'!BU13+'Mai-Ago 2025'!BU13+'Set-Dez 2025'!BU13+'Jan-Abr 2026'!BU13+'Mai-Ago 2026'!BU13+'Set-Dez 2026'!BU13+'Jan-Abr 2027'!BU13+'Mai-Ago 2027'!BU13","v":0},{"$f":"'Jan-Abr 2025'!BU13","v":0},{"$nulls":30},{"$f":"TEXT(A32,\"mmm\")","v":"mar"}]
[{"$nulls":36},0,0,0,null,0,0,0,0,0,{"$f":"'Jan-Abr 2025'!AS14+'Mai-Ago 2025'!AS14+'Set-Dez 2025'!AS14+'Jan-Abr 2026'!AS14+'Mai-Ago 2026'!AS14+'Set-Dez 2026'!AS14+'Jan-Abr 2027'!AS14+'Mai-Ago 2027'!AS14","v":0},{"$f":"'Jan-Abr 2025'!AS14","v":0},{"$nulls":3},0,0,0,null,0,0,0,0,0,{"$f":"'Jan-Abr 2025'!BG14+'Mai-Ago 2025'!BG14+'Set-Dez 2025'!BG14+'Jan-Abr 2026'!BG14+'Mai-Ago 2026'!BG14+'Set-Dez 2026'!BG14+'Jan-Abr 2027'!BG14+'Mai-Ago 2027'!BG14","v":0},{"$f":"'Jan-Abr 2025'!BG14","v":0},{"$nulls":3},0,0,0,null,0,0,0,0,0,{"$f":"'Jan-Abr 2025'!BU14+'Mai-Ago 2025'!BU14+'Set-Dez 2025'!BU14+'Jan-Abr 2026'!BU14+'Mai-Ago 2026'!BU14+'Set-Dez 2026'!BU14+'Jan-Abr 2027'!BU14+'Mai-Ago 2027'!BU14","v":0},{"$f":"'Jan-Abr 2025'!BU14","v":0},{"$nulls":30},{"$f":"TEXT(A44,\"mmm\")","v":"abr"}]
["14h00 - 14h50",{"$nulls":34},"PFL",0,0,0,25,0,0,0,0,0,{"$f":"'Jan-Abr 2025'!AS15+'Mai-Ago 2025'!AS15+'Set-Dez 2025'!AS15+'Jan-Abr 2026'!AS15+'Mai-Ago 2026'!AS15+'Set-Dez 2026'!AS15+'Jan-Abr 2027'!AS15+'Mai-Ago 2027'!AS15","v":0},{"$f":"'Jan-Abr 2025'!AS15","v":0},{"$nulls":3},0,0,0,null,0,0,0,0,0,{"$f":"'Jan-Abr 2025'!BG15+'Mai-Ago 2025'!BG15+'Set-Dez 2025'!BG15+'Jan-Abr 2026'!BG15+'Mai-Ago 2026'!BG15+'Set-Dez 2026'!BG15+'Jan-Abr 2027'!BG15+'Mai-Ago 2027'!BG15","v":0},{"$f":"'Jan-Abr 2025'!BG15","v":0},{"$nulls":3},0,0,0,null,0,0,0,0,0,{"$f":"'Jan-Abr 2025'!BU15+'Mai-Ago 2025'!BU15+'Set-Dez 2025'!BU15+'Jan-Abr 2026'!BU15+'Mai-Ago 2026'!BU15+'Set-Dez 2026'!BU15+'Jan-Abr 2027'!BU15+'Mai-Ago 2027'!BU15","v":0},{"$f":"'Jan-Abr 2025'!BU15","v":0}]
["14h50 - 15h40",{"$nulls":34},"PCC",0,0,0,25,0,0,0,0,0,{"$f":"'Jan-Abr 2025'!AS16+'Mai-Ago 2025'!AS16+'Set-Dez 2025'!AS16+'Jan-Abr 2026'!AS16+'Mai-Ago 2026'!AS16+'Set-Dez 2026'!AS16+'Jan-Abr 2027'!AS16+'Mai-Ago 2027'!AS16","v":0},{"$f":"'Jan-Abr 2025'!AS16","v":0},{"$nulls":3},0,0,0,null,0,0,0,0,0,{"$f":"'Jan-Abr 2025'!BG16+'Mai-Ago 2025'!BG16+'Set-Dez 2025'!BG16+'Jan-Abr 2026'!BG16+'Mai-Ago 2026'!BG16+'Set-Dez 2026'!BG16+'Jan-Abr 2027'!BG16+'Mai-Ago 2027'!BG16","v":0},{"$f":"'Jan-Abr 2025'!BG16","v":0},{"$nulls":3},0,0,0,null,0,0,0,0,0,{"$f":"'Jan-Abr 2025'!BU16+'Mai-Ago 2025'!BU16+'Set-Dez 2025'!BU16+'Jan-Abr 2026'!BU16+'Mai-Ago 2026'!BU16+'Set-Dez 2026'!BU16+'Jan-Abr 2027'!BU16+'Mai-Ago 2027'!BU16","v":0},{"$f":"'Jan-Abr 2025'!BU16","v":0}]
["16h00 - 16h50",{"$nulls":34},"PAA",0,0,0,25,0,0,0,0,0,{"$f":"'Jan-Abr 2025'!AS17+'Mai-Ago 2025'!AS17+'Set-Dez 2025'!AS17+'Jan-Abr 2026'!AS17+'Mai-Ago 2026'!AS17+'Set-Dez 2026'!AS17+'Jan-Abr 2027'!AS17+'Mai-Ago 2027'!AS17","v":0},{"$f":"'Jan-Abr 2025'!AS17","v":0},{"$nulls":3},0,0,0,null,0,0,0,0,0,{"$f":"'Jan-Abr 2025'!BG17+'Mai-Ago 2025'!BG17+'Set-Dez 2025'!BG17+'Jan-Abr 2026'!BG17+'Mai-Ago 2026'!BG17+'Set-Dez 2026'!BG17+'Jan-Abr 2027'!BG17+'Mai-Ago 2027'!BG17","v":0},{"$f":"'Jan-Abr 2025'!BG17","v":0},{"$nulls":3},0,0,0,null,0,0,0,0,0,{"$f":"'Jan-Abr 2025'!BU17+'Mai-Ago 2025'!BU17+'Set-Dez 2025'!BU17+'Jan-Abr 2026'!BU17+'Mai-Ago 2026'!BU17+'Set-Dez 2026'!BU17+'Jan-Abr 2027'!BU17+'Mai-Ago 2027'!BU17","v":0},{"$f":"'Jan-Abr 2025'!BU17","v":0}]
["16h50 - 17h40",{"$nulls":34},"IME",0,0,0,50,0,0,0,0,0,{"$f":"'Jan-Abr 2025'!AS18+'Mai-Ago 2025'!AS18+'Set-Dez 2025'!AS18+'Jan-Abr 2026'!AS18+'Mai-Ago 2026'!AS18+'Set-Dez 2026'!AS18+'Jan-Abr 2027'!AS18+'Mai-Ago 2027'!AS18","v":0},{"$f":"'Jan-Abr 2025'!AS18","v":0},{"$nulls":3},0,0,0,null,0,0,0,0,0,{"$f":"'Jan-Abr 2025'!BG18+'Mai-Ago 2025'!BG18+'Set-Dez 2025'!BG18+'Jan-Abr 2026'!BG18+'Mai-Ago 2026'!BG18+'Set-Dez 2026'!BG18+'Jan-Abr 2027'!BG18+'Mai-Ago 2027'!BG18","v":0},{"$f":"'Jan-Abr 2025'!BG18","v":0},{"$nulls":3},0,0,0,null,0,0,0,0,0,{"$f":"'Jan-Abr 2025'!BU18+'Mai-Ago 2025'!BU18+'Set-Dez 2025'!BU18+'Jan-Abr 2026'!BU18+'Mai-Ago 2026'!BU18+'Set-Dez 2026'!BU18+'Jan-Abr 2027'!BU18+'Mai-Ago 2027'!BU18","v":0},{"$f":"'Jan-Abr 2025'!BU18","v":0}]
[{"$nulls":35},"ELE",0,0,0,50,0,0,0,0,0,{"$f":"'Jan-Abr 2025'!AS19+'Mai-Ago 2025'!AS19+'Set-Dez 2025'!AS19+'Jan-Abr 2026'!AS19+'Mai-Ago 2026'!AS19+'Set-Dez 2026'!AS19+'Jan-Abr 2027'!AS19+'Mai-Ago 2027'!AS19","v":0},{"$f":"'Jan-Abr 2025'!AS19","v":0},{"$nulls":3},0,0,0,null,0,0,0,0,0,{"$f":"'Jan-Abr 2025'!BG19+'Mai-Ago 2025'!BG19+'Set-Dez 2025'!BG19+'Jan-Abr 2026'!BG19+'Mai-Ago 2026'!BG19+'Set-Dez 2026'!BG19+'Jan-Abr 2027'!BG19+'Mai-Ago 2027'!BG19","v":0},{"$f":"'Jan-Abr 2025'!BG19","v":0},{"$nulls":3},0,0,0,null,0,0,0,0,0,{"$f":"'Jan-Abr 2025'!BU19+'Mai-Ago 2025'!BU19+'Set-Dez 2025'!BU19+'Jan-Abr 2026'!BU19+'Mai-Ago 2026'!BU19+'Set-Dez 2026'!BU19+'Jan-Abr 2027'!BU19+'Mai-Ago 2027'!BU19","v":0},{"$f":"'Jan-Abr 2025'!BU19","v":0}]
[{"$f":"A8+DAY(EOMONTH(A8,0))","v":"2025-02-01"},null,{"$f":"IF(C21<>\"\",CHOOSE(WEEKDAY(C21,1),\"Dom.\",\"Seg.\",\"Ter.\",\"Qua.\",\"Qui.\",\"Sex.\",\"Sáb.\"),\"\")","v":"Sáb."},{"$f":"IF(D21<>\"\",CHOOSE(WEEKDAY(D21,1),\"Dom.\",\"Seg.\",\"Ter.\",\"Qua.\",\"Qui.\",\"Sex.\",\"Sáb.\"),\"\")","v":"Dom."},"Seg.","Ter.","Qua.","Qui.","Sex.","Sáb.","Dom.","Seg.","Ter.","Qua.","Qui.","Sex.","Sáb.","Dom.","Seg.","Ter.","Qua.","Qui.","Sex.","Sáb.","Dom.","Seg.","Ter.","Qua.","Qui.","Sex.","","","",null,null,"CP",0,0,0,25,0,0,0,0,0,{"$f":"'Jan-Abr 2025'!AS20+'Mai-Ago 2025'!AS20+'Set-Dez 2025'!AS20+'Jan-Abr 2026'!AS20+'Mai-Ago 2026'!AS20+'Set-Dez 2026'!AS20+'Jan-Abr 2027'!AS20+'Mai-Ago 2027'!AS20","v":0},{"$f":"'Jan-Abr 2025'!AS20","v":0},{"$nulls":3},0,0,0,null,0,0,0,0,0,{"$f":"'Jan-Abr 2025'!BG20+'Mai-Ago 2025'!BG20+'Set-Dez 2025'!BG20+'Jan-Abr 2026'!BG20+'Mai-Ago 2026'!BG20+'Set-Dez 2026'!BG20+'Jan-Abr 2027'!BG20+'Mai-Ago 2027'!BG20","v":0},{"$f":"'Jan-Abr 2025'!BG20","v":0},{"$nulls":3},0,0,0,null,0,0,0,0,0,{"$f":"'Jan-Abr 2025'!BU20+'Mai-Ago 2025'!BU20+'Set-Dez 2025'!BU20+'Jan-Abr 2026'!BU20+'Mai-Ago 2026'!BU20+'Set-Dez 2026'!BU20+'Jan-Abr 2027'!BU20+'Mai-Ago 2027'!BU20","v":0},{"$f":"'Jan-Abr 2025'!BU20","v":0}]
[null,null,{"$f":"A20","v":"2025-02-01"},{"$f":"IF(C21=\"\",\"\",IF(DAY(C21)<DAY(EOMONTH(C21,0)),C21+1,\"\"))","v":"2025-02-02"},{"$f":"IF(D21=\"\",\"\",IF(DAY(D21)<DAY(EOMONTH(D21,0)),D21+1,\"\"))","v":"2025-02-03"},{"$f":"IF(E21=\"\",\"\",IF(DAY(E21)<DAY(EOMONTH(E21,0)),E21+1,\"\"))","v":"2025-02-04"},{"$f":"IF(F21=\"\",\"\",IF(DAY(F21)<DAY(EOMONTH(F21,0)),F21+1,\"\"))","v":"2025-02-05"},{"$f":"IF(G21=\"\",\"\",IF(DAY(G21)<DAY(EOMONTH(G21,0)),G21+1,\"\"))","v":"2025-02-06"},{"$f":"IF(H21=\"\",\"\",IF(DAY(H21)<DAY(EOMONTH(H21,0)),H21+1,\"\"))","v":"2025-02-07"},{"$f":"IF(I21=\"\",\"\",IF(DAY(I21)<DAY(EOMONTH(I21,0)),I21+1,\"\"))","v":"2025-02-08"},{"$f":"IF(J21=\"\",\"\",IF(DAY(J21)<DAY(EOMONTH(J21,0)),J21+1,\"\"))","v":"2025-02-09"},{"$f":"IF(K21=\"\",\"\",IF(DAY(K21)<DAY(EOMONTH(K21,0)),K21+1,\"\"))","v":"2025-02-10"},{"$f":"IF(L21=\"\",\"\",IF(DAY(L21)<DAY(EOMONTH(L21,0)),L21+1,\"\"))","v":"2025-02-11"},{"$f":"IF(M21=\"\",\"\",IF(DAY(M21)<DAY(EOMONTH(M21,0)),M21+1,\"\"))","v":"2025-02-12"},{"$f":"IF(N21=\"\",\"\",IF(DAY(N21)<DAY(EOMONTH(N21,0)),N21+1,\"\"))","v":"2025-02-13"},{"$f":"IF(O21=\"\",\"\",IF(DAY(O21)<DAY(EOMONTH(O21,0)),O21+1,\"\"))","v":"2025-02-14"},{"$f":"IF(P21=\"\",\"\",IF(DAY(P21)<DAY(EOMONTH(P21,0)),P21+1,\"\"))","v":"2025-02-15"},{"$f":"IF(Q21=\"\",\"\",IF(DAY(Q21)<DAY(EOMONTH(Q21,0)),Q21+1,\"\"))","v":"2025-02-16"},{"$f":"IF(R21=\"\",\"\",IF(DAY(R21)<DAY(EOMONTH(R21,0)),R21+1,\"\"))","v":"2025-02-17"},{"$f":"IF(S21=\"\",\"\",IF(DAY(S21)<DAY(EOMONTH(S21,0)),S21+1,\"\"))","v":"2025-02-18"},{"$f":"IF(T21=\"\",\"\",IF(DAY(T21)<DAY(EOMONTH(T21,0)),T21+1,\"\"))","v":"2025-02-19"},{"$f":"IF(U21=\"\",\"\",IF(DAY(U21)<DAY(EOMONTH(U21,0)),U21+1,\"\"))","v":"2025-02-20"},{"$f":"IF(V21=\"\",\"\",IF(DAY(V21)<DAY(EOMONTH(V21,0)),V21+1,\"\"))","v":"2025-02-21"},{"$f":"IF(W21=\"\",\"\",IF(DAY(W21)<DAY(EOMONTH(W21,0)),W21+1,\"\"))","v":"2025-02-22"},{"$f":"IF(X21=\"\",\"\",IF(DAY(X21)<DAY(EOMONTH(X21,0)),X21+1,\"\"))","v":"2025-02-23"},{"$f":"IF(Y21=\"\",\"\",IF(DAY(Y21)<DAY(EOMONTH(Y21,0)),Y21+1,\"\"))","v":"2025-02-24"},{"$f":"IF(Z21=\"\",\"\",IF(DAY(Z21)<DAY(EOMONTH(Z21,0)),Z21+1,\"\"))","v":"2025-02-25"},{"$f":"IF(AA21=\"\",\"\",IF(DAY(AA21)<DAY(EOMONTH(AA21,0)),AA21+1,\"\"))","v":"2025-02-26"},{"$f":"IF(AB21=\"\",\"\",IF(DAY(AB21)<DAY(EOMONTH(AB21,0)),AB21+1,\"\"))","v":"2025-02-27"},{"$f":"IF(AC21=\"\",\"\",IF(DAY(AC21)<DAY(EOMONTH(AC21,0)),AC21+1,\"\"))","v":"2025-02-28"},{"$f":"IF(AD21=\"\",\"\",IF(DAY(AD21)<DAY(EOMONTH(AD21,0)),AD21+1,\"\"))","v":""},{"$f":"IF(AE21=\"\",\"\",IF(DAY(AE21)<DAY(EOMONTH(AE21,0)),AE21+1,\"\"))","v":""},{"$f":"IF(AF21=\"\",\"\",IF(DAY(AF21)<DAY(EOMONTH(AF21,0)),AF21+1,\"\"))","v":""},null,null,"CH",0,0,0,25,0,0,0,0,0,{"$f":"'Jan-Abr 2025'!AS21+'Mai-Ago 2025'!AS21+'Set-Dez 2025'!AS21+'Jan-Abr 2026'!AS21+'Mai-Ago 2026'!AS21+'Set-Dez 2026'!AS21+'Jan-Abr 2027'!AS21+'Mai-Ago 2027'!AS21","v":0},{"$f":"'Jan-Abr 2025'!AS21","v":0},{"$nulls":3},0,0,0,null,0,0,0,0,0,{"$f":"'Jan-Abr 2025'!BG21+'Mai-Ago 2025'!BG21+'Set-Dez 2025'!BG21+'Jan-Abr 2026'!BG21+'Mai-Ago 2026'!BG21+'Set-Dez 2026'!BG21+'Jan-Abr 2027'!BG21+'Mai-Ago 2027'!BG21","v":0},{"$f":"'Jan-Abr 2025'!BG21","v":0},{"$nulls":3},0,0,0,null,0,0,0,0,0,{"$f":"'Jan-Abr 2025'!BU21+'Mai-Ago 2025'!BU21+'Set-Dez 2025'!BU21+'Jan-Abr 2026'!BU21+'Mai-Ago 2026'!BU21+'Set-Dez 2026'!BU21+'Jan-Abr 2027'!BU21+'Mai-Ago 2027'!BU21","v":0},{"$f":"'Jan-Abr 2025'!BU21","v":0}]
[{"$f":"A10","v":"09h00 - 09h50"},{"$nulls":34},"CLP",0,0,0,50,0,0,0,0,0,{"$f":"'Jan-Abr 2025'!AS22+'Mai-Ago 2025'!AS22+'Set-Dez 2025'!AS22+'Jan-Abr 2026'!AS22+'Mai-Ago 2026'!AS22+'Set-Dez 2026'!AS22+'Jan-Abr 2027'!AS22+'Mai-Ago 2027'!AS22","v":0},{"$f":"'Jan-Abr 2025'!AS22","v":0},{"$nulls":3},0,0,0,null,0,0,0,0,0,{"$f":"'Jan-Abr 2025'!BG22+'Mai-Ago 2025'!BG22+'Set-Dez 2025'!BG22+'Jan-Abr 2026'!BG22+'Mai-Ago 2026'!BG22+'Set-Dez 2026'!BG22+'Jan-Abr 2027'!BG22+'Mai-Ago 2027'!BG22","v":0},{"$f":"'Jan-Abr 2025'!BG22","v":0},{"$nulls":3},0,0,0,null,0,0,0,0,0,{"$f":"'Jan-Abr 2025'!BU22+'Mai-Ago 2025'!BU22+'Set-Dez 2025'!BU22+'Jan-Abr 2026'!BU22+'Mai-Ago 2026'!BU22+'Set-Dez 2026'!BU22+'Jan-Abr 2027'!BU22+'Mai-Ago 2027'!BU22","v":0},{"$f":"'Jan-Abr 2025'!BU22","v":0}]
[{"$f":"A11","v":"09h50 - 10h40"},{"$nulls":34},"DCM",0,0,0,50,0,0,0,0,0,{"$f":"'Jan-Abr 2025'!AS23+'Mai-Ago 2025'!AS23+'Set-Dez 2025'!AS23+'Jan-Abr 2026'!AS23+'Mai-Ago 2026'!AS23+'Set-Dez 2026'!AS23+'Jan-Abr 2027'!AS23+'Mai-Ago 2027'!AS23","v":0},{"$f":"'Jan-Abr 2025'!AS23","v":0},{"$nulls":3},0,0,0,null,0,0,0,0,0,{"$f":"'Jan-Abr 2025'!BG23+'Mai-Ago 2025'!BG23+'Set-Dez 2025'!BG23+'Jan-Abr 2026'!BG23+'Mai-Ago 2026'!BG23+'Set-Dez 2026'!BG23+'Jan-Abr 2027'!BG23+'Mai-Ago 2027'!BG23","v":0},{"$f":"'Jan-Abr 2025'!BG23","v":0},{"$nulls":3},0,0,0,null,0,0,0,0,0,{"$f":"'Jan-Abr 2025'!BU23+'Mai-Ago 2025'!BU23+'Set-Dez 2025'!BU23+'Jan-Abr 2026'!BU23+'Mai-Ago 2026'!BU23+'Set-Dez 2026'!BU23+'Jan-Abr 2027'!BU23+'Mai-Ago 2027'!BU23","v":0},{"$f":"'Jan-Abr 2025'!BU23","v":0}]
["11h00 - 11h50",{"$nulls":34},"CM",0,0,0,50,0,0,0,0,0,{"$f":"'Jan-Abr 2025'!AS24+'Mai-Ago 2025'!AS24+'Set-Dez 2025'!AS24+'Jan-Abr 2026'!AS24+'Mai-Ago 2026'!AS24+'Set-Dez 2026'!AS24+'Jan-Abr 2027'!AS24+'Mai-Ago 2027'!AS24","v":0},{"$f":"'Jan-Abr 2025'!AS24","v":0},{"$nulls":3},0,0,0,null,0,0,0,0,0,{"$f":"'Jan-Abr 2025'!BG24+'Mai-Ago 2025'!BG24+'Set-Dez 2025'!BG24+'Jan-Abr 2026'!BG24+'Mai-Ago 2026'!BG24+'Set-Dez 2026'!BG24+'Jan-Abr 2027'!BG24+'Mai-Ago 2027'!BG24","v":0},{"$f":"'Jan-Abr 2025'!BG24","v":0},{"$nulls":3},0,0,0,null,0,0,0,0,0,{"$f":"'Jan-Abr 2025'!BU24+'Mai-Ago 2025'!BU24+'Set-Dez 2025'!BU24+'Jan-Abr 2026'!BU24+'Mai-Ago 2026'!BU24+'Set-Dez 2026'!BU24+'Jan-Abr 2027'!BU24+'Mai-Ago 2027'!BU24","v":0},{"$f":"'Jan-Abr 2025'!BU24","v":0}]
["11h50 - 12h40",{"$nulls":34},"SD",0,0,0,50,0,0,0,0,0,{"$f":"'Jan-Abr 2025'!AS25+'Mai-Ago 2025'!AS25+'Set-Dez 2025'!AS25+'Jan-Abr 2026'!AS25+'Mai-Ago 2026'!AS25+'Set-Dez 2026'!AS25+'Jan-Abr 2027'!AS25+'Mai-Ago 2027'!AS25","v":0},{"$f":"'Jan-Abr 2025'!AS25","v":0},{"$nulls":3},0,0,0,null,0,0,0,0,0,{"$f":"'Jan-Abr 2025'!BG25+'Mai-Ago 2025'!BG25+'Set-Dez 2025'!BG25+'Jan-Abr 2026'!BG25+'Mai-Ago 2026'!BG25+'Set-Dez 2026'!BG25+'Jan-Abr 2027'!BG25+'Mai-Ago 2027'!BG25","v":0},{"$f":"'Jan-Abr 2025'!BG25","v":0},{"$nulls":3},0,0,0,null,0,0,0,0,0,{"$f":"'Jan-Abr 2025'!BU25+'Mai-Ago 2025'!BU25+'Set-Dez 2025'!BU25+'Jan-Abr 2026'!BU25+'Mai-Ago 2026'!BU25+'Set-Dez 2026'!BU25+'Jan-Abr 2027'!BU25+'Mai-Ago 2027'!BU25","v":0},{"$f":"'Jan-Abr 2025'!BU25","v":0}]
[{"$nulls":35},"OEM",0,0,0,50,0,0,0,0,0,{"$f":"'Jan-Abr 2025'!AS26+'Mai-Ago 2025'!AS26+'Set-Dez 2025'!AS26+'Jan-Abr 2026'!AS26+'Mai-Ago 2026'!AS26+'Set-Dez 2026'!AS26+'Jan-Abr 2027'!AS26+'Mai-Ago 2027'!AS26","v":0},{"$f":"'Jan-Abr 2025'!AS26","v":0},{"$nulls":3},0,0,0,null,0,0,0,0,0,{"$f":"'Jan-Abr 2025'!BG26+'Mai-Ago 2025'!BG26+'Set-Dez 2025'!BG26+'Jan-Abr 2026'!BG26+'Mai-Ago 2026'!BG26+'Set-Dez 2026'!BG26+'Jan-Abr 2027'!BG26+'Mai-Ago 2027'!BG26","v":0},{"$f":"'Jan-Abr 2025'!BG26","v":0},{"$nulls":3},0,0,0,null,0,0,0,0,0,{"$f":"'Jan-Abr 2025'!BU26+'Mai-Ago 2025'!BU26+'Set-Dez 2025'!BU26+'Jan-Abr 2026'!BU26+'Mai-Ago 2026'!BU26+'Set-Dez 2026'!BU26+'Jan-Abr 2027'!BU26+'Mai-Ago 2027'!BU26","v":0},{"$f":"'Jan-Abr 2025'!BU26","v":0}]
["14h00 - 14h50",{"$nulls":34},"GP",0,0,0,50,0,0,0,0,0,{"$f":"'Jan-Abr 2025'!AS27+'Mai-Ago 2025'!AS27+'Set-Dez 2025'!AS27+'Jan-Abr 2026'!AS27+'Mai-Ago 2026'!AS27+'Set-Dez 2026'!AS27+'Jan-Abr 2027'!AS27+'Mai-Ago 2027'!AS27","v":0},{"$f":"'Jan-Abr 2025'!AS27","v":0},{"$nulls":3},0,0,0,null,0,0,0,0,0,{"$f":"'Jan-Abr 2025'!BG27+'Mai-Ago 2025'!BG27+'Set-Dez 2025'!BG27+'Jan-Abr 2026'!BG27+'Mai-Ago 2026'!BG27+'Set-Dez 2026'!BG27+'Jan-Abr 2027'!BG27+'Mai-Ago 2027'!BG27","v":0},{"$f":"'Jan-Abr 2025'!BG27","v":0},{"$nulls":3},0,0,0,null,0,0,0,0,0,{"$f":"'Jan-Abr 2025'!BU27+'Mai-Ago 2025'!BU27+'Set-Dez 2025'!BU27+'Jan-Abr 2026'!BU27+'Mai-Ago 2026'!BU27+'Set-Dez 2026'!BU27+'Jan-Abr 2027'!BU27+'Mai-Ago 2027'!BU27","v":0},{"$f":"'Jan-Abr 2025'!BU27","v":0}]
["14h50 - 15h40",{"$nulls":34},"PP",0,0,0,50,0,0,0,0,0,{"$f":"'Jan-Abr 2025'!AS28+'Mai-Ago 2025'!AS28+'Set-Dez 2025'!AS28+'Jan-Abr 2026'!AS28+'Mai-Ago 2026'!AS28+'Set-Dez 2026'!AS28+'Jan-Abr 2027'!AS28+'Mai-Ago 2027'!AS28","v":0},{"$f":"'Jan-Abr 2025'!AS28","v":0},{"$nulls":3},0,0,0,null,0,0,0,0,0,{"$f":"'Jan-Abr 2025'!BG28+'Mai-Ago 2025'!BG28+'Set-Dez 2025'!BG28+'Jan-Abr 2026'!BG28+'Mai-Ago 2026'!BG28+'Set-Dez 2026'!BG28+'Jan-Abr 2027'!BG28+'Mai-Ago 2027'!BG28","v":0},{"$f":"'Jan-Abr 2025'!BG28","v":0},{"$nulls":3},0,0,0,null,0,0,0,0,0,{"$f":"'Jan-Abr 2025'!BU28+'Mai-Ago 2025'!BU28+'Set-Dez 2025'!BU28+'Jan-Abr 2026'!BU28+'Mai-Ago 2026'!BU28+'Set-Dez 2026'!BU28+'Jan-Abr 2027'!BU28+'Mai-Ago 2027'!BU28","v":0},{"$f":"'Jan-Abr 2025'!BU28","v":0}]
["16h00 - 16h50",{"$nulls":34},"GS",0,0,0,50,0,0,0,0,0,{"$f":"'Jan-Abr 2025'!AS29+'Mai-Ago 2025'!AS29+'Set-Dez 2025'!AS29+'Jan-Abr 2026'!AS29+'Mai-Ago 2026'!AS29+'Set-Dez 2026'!AS29+'Jan-Abr 2027'!AS29+'Mai-Ago 2027'!AS29","v":0},{"$f":"'Jan-Abr 2025'!AS29","v":0},{"$nulls":3},0,0,0,null,0,0,0,0,0,{"$f":"'Jan-Abr 2025'!BG29+'Mai-Ago 2025'!BG29+'Set-Dez 2025'!BG29+'Jan-Abr 2026'!BG29+'Mai-Ago 2026'!BG29+'Set-Dez 2026'!BG29+'Jan-Abr 2027'!BG29+'Mai-Ago 2027'!BG29","v":0},{"$f":"'Jan-Abr 2025'!BG29","v":0},{"$nulls":3},0,0,0,null,0,0,0,0,0,{"$f":"'Jan-Abr 2025'!BU29+'Mai-Ago 2025'!BU29+'Set-Dez 2025'!BU29+'Jan-Abr 2026'!BU29+'Mai-Ago 2026'!BU29+'Set-Dez 2026'!BU29+'Jan-Abr 2027'!BU29+'Mai-Ago 2027'!BU29","v":0},{"$f":"'Jan-Abr 2025'!BU29","v":0}]
["16h50 - 17h40",{"$nulls":34},"CGO",0,0,0,50,0,0,0,0,0,{"$f":"'Jan-Abr 2025'!AS30+'Mai-Ago 2025'!AS30+'Set-Dez 2025'!AS30+'Jan-Abr 2026'!AS30+'Mai-Ago 2026'!AS30+'Set-Dez 2026'!AS30+'Jan-Abr 2027'!AS30+'Mai-Ago 2027'!AS30","v":0},{"$f":"'Jan-Abr 2025'!AS30","v":0},{"$nulls":3},0,0,0,null,0,0,0,0,0,{"$f":"'Jan-Abr 2025'!BG30+'Mai-Ago 2025'!BG30+'Set-Dez 2025'!BG30+'Jan-Abr 2026'!BG30+'Mai-Ago 2026'!BG30+'Set-Dez 2026'!BG30+'Jan-Abr 2027'!BG30+'Mai-Ago 2027'!BG30","v":0},{"$f":"'Jan-Abr 2025'!BG30","v":0},{"$nulls":3},0,0,0,null,0,0,0,0,0,{"$f":"'Jan-Abr 2025'!BU30+'Mai-Ago 2025'!BU30+'Set-Dez 2025'!BU30+'Jan-Abr 2026'!BU30+'Mai-Ago 2026'!BU30+'Set-Dez 2026'!BU30+'Jan-Abr 2027'!BU30+'Mai-Ago 2027'!BU30","v":0},{"$f":"'Jan-Abr 2025'!BU30","v":0}]
[{"$nulls":35},"LOG",0,0,0,50,0,0,0,0,0,{"$f":"'Jan-Abr 2025'!AS31+'Mai-Ago 2025'!AS31+'Set-Dez 2025'!AS31+'Jan-Abr 2026'!AS31+'Mai-Ago 2026'!AS31+'Set-Dez 2026'!AS31+'Jan-Abr 2027'!AS31+'Mai-Ago 2027'!AS31","v":0},{"$f":"'Jan-Abr 2025'!AS31","v":0},{"$nulls":3},0,0,0,null,0,0,0,0,0,{"$f":"'Jan-Abr 2025'!BG31+'Mai-Ago 2025'!BG31+'Set-Dez 2025'!BG31+'Jan-Abr 2026'!BG31+'Mai-Ago 2026'!BG31+'Set-Dez 2026'!BG31+'Jan-Abr 2027'!BG31+'Mai-Ago 2027'!BG31","v":0},{"$f":"'Jan-Abr 2025'!BG31","v":0},{"$nulls":3},0,0,0,null,0,0,0,0,0,{"$f":"'Jan-Abr 2025'!BU31+'Mai-Ago 2025'!BU31+'Set-Dez 2025'!BU31+'Jan-Abr 2026'!BU31+'Mai-Ago 2026'!BU31+'Set-Dez 2026'!BU31+'Jan-Abr 2027'!BU31+'Mai-Ago 2027'!BU31","v":0},{"$f":"'Jan-Abr 2025'!BU31","v":0}]
[{"$f":"A20+DAY(EOMONTH(A20,0))","v":"2025-03-01"},null,{"$f":"IF(C33<>\"\",CHOOSE(WEEKDAY(C33,1),\"Dom.\",\"Seg.\",\"Ter.\",\"Qua.\",\"Qui.\",\"Sex.\",\"Sáb.\"),\"\")","v":"Sáb."},{"$f":"IF(D33<>\"\",CHOOSE(WEEKDAY(D33,1),\"Dom.\",\"Seg.\",\"Ter.\",\"Qua.\",\"Qui.\",\"Sex.\",\"Sáb.\"),\"\")","v":"Dom."},"Seg.","Ter.","Qua.","Qui.","Sex.","Sáb.","Dom.","Seg.","Ter.","Qua.","Qui.","Sex.","Sáb.","Dom.","Seg.","Ter.","Qua.","Qui.","Sex.","Sáb.","Dom.","Seg.","Ter.","Qua.","Qui.","Sex.","Sáb.","Dom.","Seg.",null,null,"MOT",0,0,0,50,0,0,0,0,0,{"$f":"'Jan-Abr 2025'!AS32+'Mai-Ago 2025'!AS32+'Set-Dez 2025'!AS32+'Jan-Abr 2026'!AS32+'Mai-Ago 2026'!AS32+'Set-Dez 2026'!AS32+'Jan-Abr 2027'!AS32+'Mai-Ago 2027'!AS32","v":0},{"$f":"'Jan-Abr 2025'!AS32","v":0},{"$nulls":3},0,0,0,null,0,0,0,0,0,{"$f":"'Jan-Abr 2025'!BG32+'Mai-Ago 2025'!BG32+'Set-Dez 2025'!BG32+'Jan-Abr 2026'!BG32+'Mai-Ago 2026'!BG32+'Set-Dez 2026'!BG32+'Jan-Abr 2027'!BG32+'Mai-Ago 2027'!BG32","v":0},{"$f":"'Jan-Abr 2025'!BG32","v":0},{"$nulls":3},0,0,0,null,0,0,0,0,0,{"$f":"'Jan-Abr 2025'!BU32+'Mai-Ago 2025'!BU32+'Set-Dez 2025'!BU32+'Jan-Abr 2026'!BU32+'Mai-Ago 2026'!BU32+'Set-Dez 2026'!BU32+'Jan-Abr 2027'!BU32+'Mai-Ago 2027'!BU32","v":0},{"$f":"'Jan-Abr 2025'!BU32","v":0}]
[null,null,{"$f":"A32","v":"2025-03-01"},{"$f":"IF(C33=\"\",\"\",IF(DAY(C33)<DAY(EOMONTH(C33,0)),C33+1,\"\"))","v":"2025-03-02"},{"$f":"IF(D33=\"\",\"\",IF(DAY(D33)<DAY(EOMONTH(D33,0)),D33+1,\"\"))","v":"2025-03-03"},{"$f":"IF(E33=\"\",\"\",IF(DAY(E33)<DAY(EOMONTH(E33,0)),E33+1,\"\"))","v":"2025-03-04"},{"$f":"IF(F33=\"\",\"\",IF(DAY(F33)<DAY(EOMONTH(F33,0)),F33+1,\"\"))","v":"2025-03-05"},{"$f":"IF(G33=\"\",\"\",IF(DAY(G33)<DAY(EOMONTH(G33,0)),G33+1,\"\"))","v":"2025-03-06"},{"$f":"IF(H33=\"\",\"\",IF(DAY(H33)<DAY(EOMONTH(H33,0)),H33+1,\"\"))","v":"2025-03-07"},{"$f":"IF(I33=\"\",\"\",IF(DAY(I33)<DAY(EOMONTH(I33,0)),I33+1,\"\"))","v":"2025-03-08"},{"$f":"IF(J33=\"\",\"\",IF(DAY(J33)<DAY(EOMONTH(J33,0)),J33+1,\"\"))","v":"2025-03-09"},{"$f":"IF(K33=\"\",\"\",IF(DAY(K33)<DAY(EOMONTH(K33,0)),K33+1,\"\"))","v":"2025-03-10"},{"$f":"IF(L33=\"\",\"\",IF(DAY(L33)<DAY(EOMONTH(L33,0)),L33+1,\"\"))","v":"2025-03-11"},{"$f":"IF(M33=\"\",\"\",IF(DAY(M33)<DAY(EOMONTH(M33,0)),M33+1,\"\"))","v":"2025-03-12"},{"$f":"IF(N33=\"\",\"\",IF(DAY(N33)<DAY(EOMONTH(N33,0)),N33+1,\"\"))","v":"2025-03-13"},{"$f":"IF(O33=\"\",\"\",IF(DAY(O33)<DAY(EOMONTH(O33,0)),O33+1,\"\"))","v":"2025-03-14"},{"$f":"IF(P33=\"\",\"\",IF(DAY(P33)<DAY(EOMONTH(P33,0)),P33+1,\"\"))","v":"2025-03-15"},{"$f":"IF(Q33=\"\",\"\",IF(DAY(Q33)<DAY(EOMONTH(Q33,0)),Q33+1,\"\"))","v":"2025-03-16"},{"$f":"IF(R33=\"\",\"\",IF(DAY(R33)<DAY(EOMONTH(R33,0)),R33+1,\"\"))","v":"2025-03-17"},{"$f":"IF(S33=\"\",\"\",IF(DAY(S33)<DAY(EOMONTH(S33,0)),S33+1,\"\"))","v":"2025-03-18"},{"$f":"IF(T33=\"\",\"\",IF(DAY(T33)<DAY(EOMONTH(T33,0)),T33+1,\"\"))","v":"2025-03-19"},{"$f":"IF(U33=\"\",\"\",IF(DAY(U33)<DAY(EOMONTH(U33,0)),U33+1,\"\"))","v":"2025-03-20"},{"$f":"IF(V33=\"\",\"\",IF(DAY(V33)<DAY(EOMONTH(V33,0)),V33+1,\"\"))","v":"2025-03-21"},{"$f":"IF(W33=\"\",\"\",IF(DAY(W33)<DAY(EOMONTH(W33,0)),W33+1,\"\"))","v":"2025-03-22"},{"$f":"IF(X33=\"\",\"\",IF(DAY(X33)<DAY(EOMONTH(X33,0)),X33+1,\"\"))","v":"2025-03-23"},{"$f":"IF(Y33=\"\",\"\",IF(DAY(Y33)<DAY(EOMONTH(Y33,0)),Y33+1,\"\"))","v":"2025-03-24"},{"$f":"IF(Z33=\"\",\"\",IF(DAY(Z33)<DAY(EOMONTH(Z33,0)),Z33+1,\"\"))","v":"2025-03-25"},{"$f":"IF(AA33=\"\",\"\",IF(DAY(AA33)<DAY(EOMONTH(AA33,0)),AA33+1,\"\"))","v":"2025-03-26"},{"$f":"IF(AB33=\"\",\"\",IF(DAY(AB33)<DAY(EOMONTH(AB33,0)),AB33+1,\"\"))","v":"2025-03-27"},{"$f":"IF(AC33=\"\",\"\",IF(DAY(AC33)<DAY(EOMONTH(AC33,0)),AC33+1,\"\"))","v":"2025-03-28"},{"$f":"IF(AD33=\"\",\"\",IF(DAY(AD33)<DAY(EOMONTH(AD33,0)),AD33+1,\"\"))","v":"2025-03-29"},{"$f":"IF(AE33=\"\",\"\",IF(DAY(AE33)<DAY(EOMONTH(AE33,0)),AE33+1,\"\"))","v":"2025-03-30"},{"$f":"IF(AF33=\"\",\"\",IF(DAY(AF33)<DAY(EOMONTH(AF33,0)),AF33+1,\"\"))","v":"2025-03-31"},null,null,"SGI",0,0,0,25,0,0,0,0,0,{"$f":"'Jan-Abr 2025'!AS33+'Mai-Ago 2025'!AS33+'Set-Dez 2025'!AS33+'Jan-Abr 2026'!AS33+'Mai-Ago 2026'!AS33+'Set-Dez 2026'!AS33+'Jan-Abr 2027'!AS33+'Mai-Ago 2027'!AS33","v":0},{"$f":"'Jan-Abr 2025'!AS33","v":0},{"$nulls":3},0,0,0,null,0,0,0,0,0,{"$f":"'Jan-Abr 2025'!BG33+'Mai-Ago 2025'!BG33+'Set-Dez 2025'!BG33+'Jan-Abr 2026'!BG33+'Mai-Ago 2026'!BG33+'Set-Dez 2026'!BG33+'Jan-Abr 2027'!BG33+'Mai-Ago 2027'!BG33","v":0},{"$f":"'Jan-Abr 2025'!BG33","v":0},{"$nulls":3},0,0,0,null,0,0,0,0,0,{"$f":"'Jan-Abr 2025'!BU33+'Mai-Ago 2025'!BU33+'Set-Dez 2025'!BU33+'Jan-Abr 2026'!BU33+'Mai-Ago 2026'!BU33+'Set-Dez 2026'!BU33+'Jan-Abr 2027'!BU33+'Mai-Ago 2027'!BU33","v":0},{"$f":"'Jan-Abr 2025'!BU33","v":0}]
[{"$f":"A22","v":"09h00 - 09h50"},{"$nulls":34},"QCEP",0,0,0,50,0,0,0,0,0,{"$f":"'Jan-Abr 2025'!AS34+'Mai-Ago 2025'!AS34+'Set-Dez 2025'!AS34+'Jan-Abr 2026'!AS34+'Mai-Ago 2026'!AS34+'Set-Dez 2026'!AS34+'Jan-Abr 2027'!AS34+'Mai-Ago 2027'!AS34","v":0},{"$f":"'Jan-Abr 2025'!AS34","v":0},{"$nulls":3},0,0,0,null,0,0,0,0,0,{"$f":"'Jan-Abr 2025'!BG34+'Mai-Ago 2025'!BG34+'Set-Dez 2025'!BG34+'Jan-Abr 2026'!BG34+'Mai-Ago 2026'!BG34+'Set-Dez 2026'!BG34+'Jan-Abr 2027'!BG34+'Mai-Ago 2027'!BG34","v":0},{"$f":"'Jan-Abr 2025'!BG34","v":0},{"$nulls":3},0,0,0,null,0,0,0,0,0,{"$f":"'Jan-Abr 2025'!BU34+'Mai-Ago 2025'!BU34+'Set-Dez 2025'!BU34+'Jan-Abr 2026'!BU34+'Mai-Ago 2026'!BU34+'Set-Dez 2026'!BU34+'Jan-Abr 2027'!BU34+'Mai-Ago 2027'!BU34","v":0},{"$f":"'Jan-Abr 2025'!BU34","v":0}]
[{"$f":"A23","v":"09h50 - 10h40"},{"$nulls":4},"Entrudo",{"$nulls":30},0,0,0,null,0,0,0,0,0,{"$f":"'Jan-Abr 2025'!AS35+'Mai-Ago 2025'!AS35+'Set-Dez 2025'!AS35+'Jan-Abr 2026'!AS35+'Mai-Ago 2026'!AS35+'Set-Dez 2026'!AS35+'Jan-Abr 2027'!AS35+'Mai-Ago 2027'!AS35","v":0},{"$f":"'Jan-Abr 2025'!AS35","v":0},{"$nulls":3},0,0,0,null,0,0,0,0,0,{"$f":"'Jan-Abr 2025'!BG35+'Mai-Ago 2025'!BG35+'Set-Dez 2025'!BG35+'Jan-Abr 2026'!BG35+'Mai-Ago 2026'!BG35+'Set-Dez 2026'!BG35+'Jan-Abr 2027'!BG35+'Mai-Ago 2027'!BG35","v":0},{"$f":"'Jan-Abr 2025'!BG35","v":0},{"$nulls":3},0,0,0,null,0,0,0,0,0,{"$f":"'Jan-Abr 2025'!BU35+'Mai-Ago 2025'!BU35+'Set-Dez 2025'!BU35+'Jan-Abr 2026'!BU35+'Mai-Ago 2026'!BU35+'Set-Dez 2026'!BU35+'Jan-Abr 2027'!BU35+'Mai-Ago 2027'!BU35","v":0},{"$f":"'Jan-Abr 2025'!BU35","v":0}]
["11h00 - 11h50",{"$nulls":35},0,0,0,null,0,0,0,0,0,{"$f":"'Jan-Abr 2025'!AS36+'Mai-Ago 2025'!AS36+'Set-Dez 2025'!AS36+'Jan-Abr 2026'!AS36+'Mai-Ago 2026'!AS36+'Set-Dez 2026'!AS36+'Jan-Abr 2027'!AS36+'Mai-Ago 2027'!AS36","v":0},{"$f":"'Jan-Abr 2025'!AS36","v":0},{"$nulls":3},0,0,0,null,0,0,0,0,0,{"$f":"'Jan-Abr 2025'!BG36+'Mai-Ago 2025'!BG36+'Set-Dez 2025'!BG36+'Jan-Abr 2026'!BG36+'Mai-Ago 2026'!BG36+'Set-Dez 2026'!BG36+'Jan-Abr 2027'!BG36+'Mai-Ago 2027'!BG36","v":0},{"$f":"'Jan-Abr 2025'!BG36","v":0},{"$nulls":3},0,0,0,null,0,0,0,0,0,{"$f":"'Jan-Abr 2025'!BU36+'Mai-Ago 2025'!BU36+'Set-Dez 2025'!BU36+'Jan-Abr 2026'!BU36+'Mai-Ago 2026'!BU36+'Set-Dez 2026'!BU36+'Jan-Abr 2027'!BU36+'Mai-Ago 2027'!BU36","v":0},{"$f":"'Jan-Abr 2025'!BU36","v":0}]
["11h50 - 12h40",{"$nulls":35},0,0,0,null,0,0,0,0,0,{"$f":"'Jan-Abr 2025'!AS37+'Mai-Ago 2025'!AS37+'Set-Dez 2025'!AS37+'Jan-Abr 2026'!AS37+'Mai-Ago 2026'!AS37+'Set-Dez 2026'!AS37+'Jan-Abr 2027'!AS37+'Mai-Ago 2027'!AS37","v":0},{"$f":"'Jan-Abr 2025'!AS37","v":0},{"$nulls":3},0,0,0,null,0,0,0,0,0,{"$f":"'Jan-Abr 2025'!BG37+'Mai-Ago 2025'!BG37+'Set-Dez 2025'!BG37+'Jan-Abr 2026'!BG37+'Mai-Ago 2026'!BG37+'Set-Dez 2026'!BG37+'Jan-Abr 2027'!BG37+'Mai-Ago 2027'!BG37","v":0},{"$f":"'Jan-Abr 2025'!BG37","v":0},{"$nulls":3},0,0,0,null,0,0,0,0,0,{"$f":"'Jan-Abr 2025'!BU37+'Mai-Ago 2025'!BU37+'Set-Dez 2025'!BU37+'Jan-Abr 2026'!BU37+'Mai-Ago 2026'!BU37+'Set-Dez 2026'!BU37+'Jan-Abr 2027'!BU37+'Mai-Ago 2027'!BU37","v":0},{"$f":"'Jan-Abr 2025'!BU37","v":0}]
[{"$nulls":36},0,0,0,null,0,0,0,0,0,{"$f":"'Jan-Abr 2025'!AS38+'Mai-Ago 2025'!AS38+'Set-Dez 2025'!AS38+'Jan-Abr 2026'!AS38+'Mai-Ago 2026'!AS38+'Set-Dez 2026'!AS38+'Jan-Abr 2027'!AS38+'Mai-Ago 2027'!AS38","v":0},{"$f":"'Jan-Abr 2025'!AS38","v":0},{"$nulls":3},0,0,0,null,0,0,0,0,0,{"$f":"'Jan-Abr 2025'!BG38+'Mai-Ago 2025'!BG38+'Set-Dez 2025'!BG38+'Jan-Abr 2026'!BG38+'Mai-Ago 2026'!BG38+'Set-Dez 2026'!BG38+'Jan-Abr 2027'!BG38+'Mai-Ago 2027'!BG38","v":0},{"$f":"'Jan-Abr 2025'!BG38","v":0},{"$nulls":3},0,0,0,null,0,0,0,0,0,{"$f":"'Jan-Abr 2025'!BU38+'Mai-Ago 2025'!BU38+'Set-Dez 2025'!BU38+'Jan-Abr 2026'!BU38+'Mai-Ago 2026'!BU38+'Set-Dez 2026'!BU38+'Jan-Abr 2027'!BU38+'Mai-Ago 2027'!BU38","v":0},{"$f":"'Jan-Abr 2025'!BU38","v":0}]
["14h00 - 14h50",{"$nulls":35},0,0,0,null,0,0,0,0,0,{"$f":"'Jan-Abr 2025'!AS39+'Mai-Ago 2025'!AS39+'Set-Dez 2025'!AS39+'Jan-Abr 2026'!AS39+'Mai-Ago 2026'!AS39+'Set-Dez 2026'!AS39+'Jan-Abr 2027'!AS39+'Mai-Ago 2027'!AS39","v":0},{"$f":"'Jan-Abr 2025'!AS39","v":0},{"$nulls":3},0,0,0,null,0,0,0,0,0,{"$f":"'Jan-Abr 2025'!BG39+'Mai-Ago 2025'!BG39+'Set-Dez 2025'!BG39+'Jan-Abr 2026'!BG39+'Mai-Ago 2026'!BG39+'Set-Dez 2026'!BG39+'Jan-Abr 2027'!BG39+'Mai-Ago 2027'!BG39","v":0},{"$f":"'Jan-Abr 2025'!BG39","v":0},{"$nulls":3},0,0,0,null,0,0,0,0,0,{"$f":"'Jan-Abr 2025'!BU39+'Mai-Ago 2025'!BU39+'Set-Dez 2025'!BU39+'Jan-Abr 2026'!BU39+'Mai-Ago 2026'!BU39+'Set-Dez 2026'!BU39+'Jan-Abr 2027'!BU39+'Mai-Ago 2027'!BU39","v":0},{"$f":"'Jan-Abr 2025'!BU39","v":0}]
["14h50 - 15h40",{"$nulls":35},{"$f":"IF(AI40=$DC$8,AM40,IF(AI40=$DC$9,AM40,IF(AI40=$DC$10,AL40,)))","v":0},0,0,null,0,0,0,0,{"$f":"SUM(AO40:AR40)","v":0},{"$f":"'Jan-Abr 2025'!AS40+'Mai-Ago 2025'!AS40+'Set-Dez 2025'!AS40+'Jan-Abr 2026'!AS40+'Mai-Ago 2026'!AS40+'Set-Dez 2026'!AS40+'Jan-Abr 2027'!AS40+'Mai-Ago 2027'!AS40","v":0},{"$f":"'Jan-Abr 2025'!AS40","v":0},{"$nulls":3},{"$f":"IF(AW40=$DC$8,BA40,IF(AW40=$DC$9,BA40,IF(AW40=$DC$10,AZ40,)))","v":0},0,0,null,0,0,0,0,{"$f":"SUM(BC40:BF40)","v":0},{"$f":"'Jan-Abr 2025'!BG40+'Mai-Ago 2025'!BG40+'Set-Dez 2025'!BG40+'Jan-Abr 2026'!BG40+'Mai-Ago 2026'!BG40+'Set-Dez 2026'!BG40+'Jan-Abr 2027'!BG40+'Mai-Ago 2027'!BG40","v":0},{"$f":"'Jan-Abr 2025'!BG40","v":0},{"$nulls":3},{"$f":"IF(BK40=$DC$8,BO40,IF(BK40=$DC$9,BO40,IF(BK40=$DC$10,BN40,)))","v":0},0,0,null,0,0,0,0,{"$f":"SUM(BQ40:BT40)","v":0},{"$f":"'Jan-Abr 2025'!BU40+'Mai-Ago 2025'!BU40+'Set-Dez 2025'!BU40+'Jan-Abr 2026'!BU40+'Mai-Ago 2026'!BU40+'Set-Dez 2026'!BU40+'Jan-Abr 2027'!BU40+'Mai-Ago 2027'!BU40","v":0},{"$f":"'Jan-Abr 2025'!BU40","v":0}]
["16h00 - 16h50",{"$nulls":35},0,0,0,null,0,0,0,0,0,{"$f":"'Jan-Abr 2025'!AS41+'Mai-Ago 2025'!AS41+'Set-Dez 2025'!AS41+'Jan-Abr 2026'!AS41+'Mai-Ago 2026'!AS41+'Set-Dez 2026'!AS41+'Jan-Abr 2027'!AS41+'Mai-Ago 2027'!AS41","v":0},{"$f":"'Jan-Abr 2025'!AS41","v":0},{"$nulls":3},0,0,0,null,0,0,0,0,0,{"$f":"'Jan-Abr 2025'!BG41+'Mai-Ago 2025'!BG41+'Set-Dez 2025'!BG41+'Jan-Abr 2026'!BG41+'Mai-Ago 2026'!BG41+'Set-Dez 2026'!BG41+'Jan-Abr 2027'!BG41+'Mai-Ago 2027'!BG41","v":0},{"$f":"'Jan-Abr 2025'!BG41","v":0},{"$nulls":3},0,0,0,null,0,0,0,0,0,{"$f":"'Jan-Abr 2025'!BU41+'Mai-Ago 2025'!BU41+'Set-Dez 2025'!BU41+'Jan-Abr 2026'!BU41+'Mai-Ago 2026'!BU41+'Set-Dez 2026'!BU41+'Jan-Abr 2027'!BU41+'Mai-Ago 2027'!BU41","v":0},{"$f":"'Jan-Abr 2025'!BU41","v":0}]
["16h50 - 17h40",{"$nulls":35},0,0,0,null,0,0,0,0,0,{"$f":"'Jan-Abr 2025'!AS42+'Mai-Ago 2025'!AS42+'Set-Dez 2025'!AS42+'Jan-Abr 2026'!AS42+'Mai-Ago 2026'!AS42+'Set-Dez 2026'!AS42+'Jan-Abr 2027'!AS42+'Mai-Ago 2027'!AS42","v":0},{"$f":"'Jan-Abr 2025'!AS42","v":0},{"$nulls":3},0,0,0,null,0,0,0,0,0,{"$f":"'Jan-Abr 2025'!BG42+'Mai-Ago 2025'!BG42+'Set-Dez 2025'!BG42+'Jan-Abr 2026'!BG42+'Mai-Ago 2026'!BG42+'Set-Dez 2026'!BG42+'Jan-Abr 2027'!BG42+'Mai-Ago 2027'!BG42","v":0},{"$f":"'Jan-Abr 2025'!BG42","v":0},{"$nulls":3},0,0,0,null,0,0,0,0,0,{"$f":"'Jan-Abr 2025'!BU42+'Mai-Ago 2025'!BU42+'Set-Dez 2025'!BU42+'Jan-Abr 2026'!BU42+'Mai-Ago 2026'!BU42+'Set-Dez 2026'!BU42+'Jan-Abr 2027'!BU42+'Mai-Ago 2027'!BU42","v":0},{"$f":"'Jan-Abr 2025'!BU42","v":0}]
[{"$nulls":36},0,0,0,null,0,0,0,0,0,{"$f":"'Jan-Abr 2025'!AS43+'Mai-Ago 2025'!AS43+'Set-Dez 2025'!AS43+'Jan-Abr 2026'!AS43+'Mai-Ago 2026'!AS43+'Set-Dez 2026'!AS43+'Jan-Abr 2027'!AS43+'Mai-Ago 2027'!AS43","v":0},{"$f":"'Jan-Abr 2025'!AS43","v":0},{"$nulls":3},0,0,0,null,0,0,0,0,0,{"$f":"'Jan-Abr 2025'!BG43+'Mai-Ago 2025'!BG43+'Set-Dez 2025'!BG43+'Jan-Abr 2026'!BG43+'Mai-Ago 2026'!BG43+'Set-Dez 2026'!BG43+'Jan-Abr 2027'!BG43+'Mai-Ago 2027'!BG43","v":0},{"$f":"'Jan-Abr 2025'!BG43","v":0},{"$nulls":3},0,0,0,null,0,0,0,0,0,{"$f":"'Jan-Abr 2025'!BU43+'Mai-Ago 2025'!BU43+'Set-Dez 2025'!BU43+'Jan-Abr 2026'!BU43+'Mai-Ago 2026'!BU43+'Set-Dez 2026'!BU43+'Jan-Abr 2027'!BU43+'Mai-Ago 2027'!BU43","v":0},{"$f":"'Jan-Abr 2025'!BU43","v":0}]
[{"$f":"A32+DAY(EOMONTH(A32,0))","v":"2025-04-01"},null,{"$f":"IF(C45<>\"\",CHOOSE(WEEKDAY(C45,1),\"Dom.\",\"Seg.\",\"Ter.\",\"Qua.\",\"Qui.\",\"Sex.\",\"Sáb.\"),\"\")","v":"Ter."},{"$f":"IF(D45<>\"\",CHOOSE(WEEKDAY(D45,1),\"Dom.\",\"Seg.\",\"Ter.\",\"Qua.\",\"Qui.\",\"Sex.\",\"Sáb.\"),\"\")","v":"Qua."},"Qui.","Sex.","Sáb.","Dom.","Seg.","Ter.","Qua.","Qui.","Sex.","Sáb.","Dom.","Seg.","Ter.","Qua.","Qui.","Sex.","Sáb.","Dom.","Seg.","Ter.","Qua.","Qui.","Sex.","Sáb.","Dom.","Seg.","Ter.","Qua.","",{"$nulls":3},0,0,0,null,0,0,0,0,0,{"$f":"'Jan-Abr 2025'!AS44+'Mai-Ago 2025'!AS44+'Set-Dez 2025'!AS44+'Jan-Abr 2026'!AS44+'Mai-Ago 2026'!AS44+'Set-Dez 2026'!AS44+'Jan-Abr 2027'!AS44+'Mai-Ago 2027'!AS44","v":0},{"$f":"'Jan-Abr 2025'!AS44","v":0},{"$nulls":3},0,0,0,null,0,0,0,0,0,{"$f":"'Jan-Abr 2025'!BG44+'Mai-Ago 2025'!BG44+'Set-Dez 2025'!BG44+'Jan-Abr 2026'!BG44+'Mai-Ago 2026'!BG44+'Set-Dez 2026'!BG44+'Jan-Abr 2027'!BG44+'Mai-Ago 2027'!BG44","v":0},{"$f":"'Jan-Abr 2025'!BG44","v":0},{"$nulls":3},0,0,0,null,0,0,0,0,0,{"$f":"'Jan-Abr 2025'!BU44+'Mai-Ago 2025'!BU44+'Set-Dez 2025'!BU44+'Jan-Abr 2026'!BU44+'Mai-Ago 2026'!BU44+'Set-Dez 2026'!BU44+'Jan-Abr 2027'!BU44+'Mai-Ago 2027'!BU44","v":0},{"$f":"'Jan-Abr 2025'!BU44","v":0}]
[null,null,{"$f":"A44","v":"2025-04-01"},{"$f":"IF(C45=\"\",\"\",IF(DAY(C45)<DAY(EOMONTH(C45,0)),C45+1,\"\"))","v":"2025-04-02"},{"$f":"IF(D45=\"\",\"\",IF(DAY(D45)<DAY(EOMONTH(D45,0)),D45+1,\"\"))","v":"2025-04-03"},{"$f":"IF(E45=\"\",\"\",IF(DAY(E45)<DAY(EOMONTH(E45,0)),E45+1,\"\"))","v":"2025-04-04"},{"$f":"IF(F45=\"\",\"\",IF(DAY(F45)<DAY(EOMONTH(F45,0)),F45+1,\"\"))","v":"2025-04-05"},{"$f":"IF(G45=\"\",\"\",IF(DAY(G45)<DAY(EOMONTH(G45,0)),G45+1,\"\"))","v":"2025-04-06"},{"$f":"IF(H45=\"\",\"\",IF(DAY(H45)<DAY(EOMONTH(H45,0)),H45+1,\"\"))","v":"2025-04-07"},{"$f":"IF(I45=\"\",\"\",IF(DAY(I45)<DAY(EOMONTH(I45,0)),I45+1,\"\"))","v":"2025-04-08"},{"$f":"IF(J45=\"\",\"\",IF(DAY(J45)<DAY(EOMONTH(J45,0)),J45+1,\"\"))","v":"2025-04-09"},{"$f":"IF(K45=\"\",\"\",IF(DAY(K45)<DAY(EOMONTH(K45,0)),K45+1,\"\"))","v":"2025-04-10"},{"$f":"IF(L45=\"\",\"\",IF(DAY(L45)<DAY(EOMONTH(L45,0)),L45+1,\"\"))","v":"2025-04-11"},{"$f":"IF(M45=\"\",\"\",IF(DAY(M45)<DAY(EOMONTH(M45,0)),M45+1,\"\"))","v":"2025-04-12"},{"$f":"IF(N45=\"\",\"\",IF(DAY(N45)<DAY(EOMONTH(N45,0)),N45+1,\"\"))","v":"2025-04-13"},{"$f":"IF(O45=\"\",\"\",IF(DAY(O45)<DAY(EOMONTH(O45,0)),O45+1,\"\"))","v":"2025-04-14"},{"$f":"IF(P45=\"\",\"\",IF(DAY(P45)<DAY(EOMONTH(P45,0)),P45+1,\"\"))","v":"2025-04-15"},{"$f":"IF(Q45=\"\",\"\",IF(DAY(Q45)<DAY(EOMONTH(Q45,0)),Q45+1,\"\"))","v":"2025-04-16"},{"$f":"IF(R45=\"\",\"\",IF(DAY(R45)<DAY(EOMONTH(R45,0)),R45+1,\"\"))","v":"2025-04-17"},{"$f":"IF(S45=\"\",\"\",IF(DAY(S45)<DAY(EOMONTH(S45,0)),S45+1,\"\"))","v":"2025-04-18"},{"$f":"IF(T45=\"\",\"\",IF(DAY(T45)<DAY(EOMONTH(T45,0)),T45+1,\"\"))","v":"2025-04-19"},{"$f":"IF(U45=\"\",\"\",IF(DAY(U45)<DAY(EOMONTH(U45,0)),U45+1,\"\"))","v":"2025-04-20"},{"$f":"IF(V45=\"\",\"\",IF(DAY(V45)<DAY(EOMONTH(V45,0)),V45+1,\"\"))","v":"2025-04-21"},{"$f":"IF(W45=\"\",\"\",IF(DAY(W45)<DAY(EOMONTH(W45,0)),W45+1,\"\"))","v":"2025-04-22"},{"$f":"IF(X45=\"\",\"\",IF(DAY(X45)<DAY(EOMONTH(X45,0)),X45+1,\"\"))","v":"2025-04-23"},{"$f":"IF(Y45=\"\",\"\",IF(DAY(Y45)<DAY(EOMONTH(Y45,0)),Y45+1,\"\"))","v":"2025-04-24"},{"$f":"IF(Z45=\"\",\"\",IF(DAY(Z45)<DAY(EOMONTH(Z45,0)),Z45+1,\"\"))","v":"2025-04-25"},{"$f":"IF(AA45=\"\",\"\",IF(DAY(AA45)<DAY(EOMONTH(AA45,0)),AA45+1,\"\"))","v":"2025-04-26"},{"$f":"IF(AB45=\"\",\"\",IF(DAY(AB45)<DAY(EOMONTH(AB45,0)),AB45+1,\"\"))","v":"2025-04-27"},{"$f":"IF(AC45=\"\",\"\",IF(DAY(AC45)<DAY(EOMONTH(AC45,0)),AC45+1,\"\"))","v":"2025-04-28"},{"$f":"IF(AD45=\"\",\"\",IF(DAY(AD45)<DAY(EOMONTH(AD45,0)),AD45+1,\"\"))","v":"2025-04-29"},{"$f":"IF(AE45=\"\",\"\",IF(DAY(AE45)<DAY(EOMONTH(AE45,0)),AE45+1,\"\"))","v":"2025-04-30"},{"$f":"IF(AF45=\"\",\"\",IF(DAY(AF45)<DAY(EOMONTH(AF45,0)),AF45+1,\"\"))","v":""},{"$nulls":3},0,0,0,null,0,0,0,0,0,{"$f":"'Jan-Abr 2025'!AS45+'Mai-Ago 2025'!AS45+'Set-Dez 2025'!AS45+'Jan-Abr 2026'!AS45+'Mai-Ago 2026'!AS45+'Set-Dez 2026'!AS45+'Jan-Abr 2027'!AS45+'Mai-Ago 2027'!AS45","v":0},{"$f":"'Jan-Abr 2025'!AS45","v":0},{"$nulls":3},0,0,0,null,0,0,0,0,0,{"$f":"'Jan-Abr 2025'!BG45+'Mai-Ago 2025'!BG45+'Set-Dez 2025'!BG45+'Jan-Abr 2026'!BG45+'Mai-Ago 2026'!BG45+'Set-Dez 2026'!BG45+'Jan-Abr 2027'!BG45+'Mai-Ago 2027'!BG45","v":0},{"$f":"'Jan-Abr 2025'!BG45","v":0},{"$nulls":3},0,0,0,null,0,0,0,0,0,{"$f":"'Jan-Abr 2025'!BU45+'Mai-Ago 2025'!BU45+'Set-Dez 2025'!BU45+'Jan-Abr 2026'!BU45+'Mai-Ago 2026'!BU45+'Set-Dez 2026'!BU45+'Jan-Abr 2027'!BU45+'Mai-Ago 2027'!BU45","v":0},{"$f":"'Jan-Abr 2025'!BU45","v":0}]
[{"$f":"A10","v":"09h00 - 09h50"},{"$nulls":18},"Sexta",{"$nulls":16},0,0,0,null,0,0,0,0,0,{"$f":"'Jan-Abr 2025'!AS46+'Mai-Ago 2025'!AS46+'Set-Dez 2025'!AS46+'Jan-Abr 2026'!AS46+'Mai-Ago 2026'!AS46+'Set-Dez 2026'!AS46+'Jan-Abr 2027'!AS46+'Mai-Ago 2027'!AS46","v":0},{"$f":"'Jan-Abr 2025'!AS46","v":0},{"$nulls":3},0,0,0,null,0,0,0,0,0,{"$f":"'Jan-Abr 2025'!BG46+'Mai-Ago 2025'!BG46+'Set-Dez 2025'!BG46+'Jan-Abr 2026'!BG46+'Mai-Ago 2026'!BG46+'Set-Dez 2026'!BG46+'Jan-Abr 2027'!BG46+'Mai-Ago 2027'!BG46","v":0},{"$f":"'Jan-Abr 2025'!BG46","v":0},{"$nulls":3},0,0,0,null,0,0,0,0,0,{"$f":"'Jan-Abr 2025'!BU46+'Mai-Ago 2025'!BU46+'Set-Dez 2025'!BU46+'Jan-Abr 2026'!BU46+'Mai-Ago 2026'!BU46+'Set-Dez 2026'!BU46+'Jan-Abr 2027'!BU46+'Mai-Ago 2027'!BU46","v":0},{"$f":"'Jan-Abr 2025'!BU46","v":0}]
[{"$f":"A11","v":"09h50 - 10h40"},{"$nulls":18},"Feira",null,"Pascoa",{"$nulls":4},"Liberd.",{"$nulls":9},0,0,0,null,0,0,0,0,0,{"$f":"'Jan-Abr 2025'!AS47+'Mai-Ago 2025'!AS47+'Set-Dez 2025'!AS47+'Jan-Abr 2026'!AS47+'Mai-Ago 2026'!AS47+'Set-Dez 2026'!AS47+'Jan-Abr 2027'!AS47+'Mai-Ago 2027'!AS47","v":0},{"$f":"'Jan-Abr 2025'!AS47","v":0},{"$nulls":3},0,0,0,null,0,0,0,0,0,{"$f":"'Jan-Abr 2025'!BG47+'Mai-Ago 2025'!BG47+'Set-Dez 2025'!BG47+'Jan-Abr 2026'!BG47+'Mai-Ago 2026'!BG47+'Set-Dez 2026'!BG47+'Jan-Abr 2027'!BG47+'Mai-Ago 2027'!BG47","v":0},{"$f":"'Jan-Abr 2025'!BG47","v":0},{"$nulls":3},0,0,0,null,0,0,0,0,0,{"$f":"'Jan-Abr 2025'!BU47+'Mai-Ago 2025'!BU47+'Set-Dez 2025'!BU47+'Jan-Abr 2026'!BU47+'Mai-Ago 2026'!BU47+'Set-Dez 2026'!BU47+'Jan-Abr 2027'!BU47+'Mai-Ago 2027'!BU47","v":0},{"$f":"'Jan-Abr 2025'!BU47","v":0}]
["11h00 - 11h50",{"$nulls":18},"Santa",{"$nulls":16},0,0,0,null,0,0,0,0,0,{"$f":"'Jan-Abr 2025'!AS48+'Mai-Ago 2025'!AS48+'Set-Dez 2025'!AS48+'Jan-Abr 2026'!AS48+'Mai-Ago 2026'!AS48+'Set-Dez 2026'!AS48+'Jan-Abr 2027'!AS48+'Mai-Ago 2027'!AS48","v":0},{"$f":"'Jan-Abr 2025'!AS48","v":0},{"$nulls":3},0,0,0,null,0,0,0,0,0,{"$f":"'Jan-Abr 2025'!BG48+'Mai-Ago 2025'!BG48+'Set-Dez 2025'!BG48+'Jan-Abr 2026'!BG48+'Mai-Ago 2026'!BG48+'Set-Dez 2026'!BG48+'Jan-Abr 2027'!BG48+'Mai-Ago 2027'!BG48","v":0},{"$f":"'Jan-Abr 2025'!BG48","v":0},{"$nulls":3},0,0,0,null,0,0,0,0,0,{"$f":"'Jan-Abr 2025'!BU48+'Mai-Ago 2025'!BU48+'Set-Dez 2025'!BU48+'Jan-Abr 2026'!BU48+'Mai-Ago 2026'!BU48+'Set-Dez 2026'!BU48+'Jan-Abr 2027'!BU48+'Mai-Ago 2027'!BU48","v":0},{"$f":"'Jan-Abr 2025'!BU48","v":0}]
["11h50 - 12h40",{"$nulls":35},0,0,0,null,0,0,0,0,0,{"$f":"'Jan-Abr 2025'!AS49+'Mai-Ago 2025'!AS49+'Set-Dez 2025'!AS49+'Jan-Abr 2026'!AS49+'Mai-Ago 2026'!AS49+'Set-Dez 2026'!AS49+'Jan-Abr 2027'!AS49+'Mai-Ago 2027'!AS49","v":0},{"$f":"'Jan-Abr 2025'!AS49","v":0},{"$nulls":3},0,0,0,null,0,0,0,0,0,{"$f":"'Jan-Abr 2025'!BG49+'Mai-Ago 2025'!BG49+'Set-Dez 2025'!BG49+'Jan-Abr 2026'!BG49+'Mai-Ago 2026'!BG49+'Set-Dez 2026'!BG49+'Jan-Abr 2027'!BG49+'Mai-Ago 2027'!BG49","v":0},{"$f":"'Jan-Abr 2025'!BG49","v":0},{"$nulls":3},0,0,0,null,0,0,0,0,0,{"$f":"'Jan-Abr 2025'!BU49+'Mai-Ago 2025'!BU49+'Set-Dez 2025'!BU49+'Jan-Abr 2026'!BU49+'Mai-Ago 2026'!BU49+'Set-Dez 2026'!BU49+'Jan-Abr 2027'!BU49+'Mai-Ago 2027'!BU49","v":0},{"$f":"'Jan-Abr 2025'!BU49","v":0}]
[{"$nulls":36},0,0,0,null,0,0,0,0,0,{"$f":"'Jan-Abr 2025'!AS50+'Mai-Ago 2025'!AS50+'Set-Dez 2025'!AS50+'Jan-Abr 2026'!AS50+'Mai-Ago 2026'!AS50+'Set-Dez 2026'!AS50+'Jan-Abr 2027'!AS50+'Mai-Ago 2027'!AS50","v":0},{"$f":"'Jan-Abr 2025'!AS50","v":0},{"$nulls":3},0,0,0,null,0,0,0,0,0,{"$f":"'Jan-Abr 2025'!BG50+'Mai-Ago 2025'!BG50+'Set-Dez 2025'!BG50+'Jan-Abr 2026'!BG50+'Mai-Ago 2026'!BG50+'Set-Dez 2026'!BG50+'Jan-Abr 2027'!BG50+'Mai-Ago 2027'!BG50","v":0},{"$f":"'Jan-Abr 2025'!BG50","v":0},{"$nulls":3},0,0,0,null,0,0,0,0,0,{"$f":"'Jan-Abr 2025'!BU50+'Mai-Ago 2025'!BU50+'Set-Dez 2025'!BU50+'Jan-Abr 2026'!BU50+'Mai-Ago 2026'!BU50+'Set-Dez 2026'!BU50+'Jan-Abr 2027'!BU50+'Mai-Ago 2027'!BU50","v":0},{"$f":"'Jan-Abr 2025'!BU50","v":0}]
["14h00 - 14h50",{"$nulls":35},0,0,0,null,0,0,0,0,0,{"$f":"'Jan-Abr 2025'!AS51+'Mai-Ago 2025'!AS51+'Set-Dez 2025'!AS51+'Jan-Abr 2026'!AS51+'Mai-Ago 2026'!AS51+'Set-Dez 2026'!AS51+'Jan-Abr 2027'!AS51+'Mai-Ago 2027'!AS51","v":0},{"$f":"'Jan-Abr 2025'!AS51","v":0},{"$nulls":3},0,0,0,null,0,0,0,0,0,{"$f":"'Jan-Abr 2025'!BG51+'Mai-Ago 2025'!BG51+'Set-Dez 2025'!BG51+'Jan-Abr 2026'!BG51+'Mai-Ago 2026'!BG51+'Set-Dez 2026'!BG51+'Jan-Abr 2027'!BG51+'Mai-Ago 2027'!BG51","v":0},{"$f":"'Jan-Abr 2025'!BG51","v":0},{"$nulls":3},0,0,0,null,0,0,0,0,0,{"$f":"'Jan-Abr 2025'!BU51+'Mai-Ago 2025'!BU51+'Set-Dez 2025'!BU51+'Jan-Abr 2026'!BU51+'Mai-Ago 2026'!BU51+'Set-Dez 2026'!BU51+'Jan-Abr 2027'!BU51+'Mai-Ago 2027'!BU51","v":0},{"$f":"'Jan-Abr 2025'!BU51","v":0}]
["14h50 - 15h40",{"$nulls":35},0,0,0,null,0,0,0,0,0,{"$f":"'Jan-Abr 2025'!AS52+'Mai-Ago 2025'!AS52+'Set-Dez 2025'!AS52+'Jan-Abr 2026'!AS52+'Mai-Ago 2026'!AS52+'Set-Dez 2026'!AS52+'Jan-Abr 2027'!AS52+'Mai-Ago 2027'!AS52","v":0},{"$f":"'Jan-Abr 2025'!AS52","v":0},{"$nulls":3},0,0,0,null,0,0,0,0,0,{"$f":"'Jan-Abr 2025'!BG52+'Mai-Ago 2025'!BG52+'Set-Dez 2025'!BG52+'Jan-Abr 2026'!BG52+'Mai-Ago 2026'!BG52+'Set-Dez 2026'!BG52+'Jan-Abr 2027'!BG52+'Mai-Ago 2027'!BG52","v":0},{"$f":"'Jan-Abr 2025'!BG52","v":0},{"$nulls":3},0,0,0,null,0,0,0,0,0,{"$f":"'Jan-Abr 2025'!BU52+'Mai-Ago 2025'!BU52+'Set-Dez 2025'!BU52+'Jan-Abr 2026'!BU52+'Mai-Ago 2026'!BU52+'Set-Dez 2026'!BU52+'Jan-Abr 2027'!BU52+'Mai-Ago 2027'!BU52","v":0},{"$f":"'Jan-Abr 2025'!BU52","v":0}]
["16h00 - 16h50",{"$nulls":35},0,0,0,null,0,0,0,0,0,{"$f":"'Jan-Abr 2025'!AS53+'Mai-Ago 2025'!AS53+'Set-Dez 2025'!AS53+'Jan-Abr 2026'!AS53+'Mai-Ago 2026'!AS53+'Set-Dez 2026'!AS53+'Jan-Abr 2027'!AS53+'Mai-Ago 2027'!AS53","v":0},{"$f":"'Jan-Abr 2025'!AS53","v":0},{"$nulls":3},0,0,0,null,0,0,0,0,0,{"$f":"'Jan-Abr 2025'!BG53+'Mai-Ago 2025'!BG53+'Set-Dez 2025'!BG53+'Jan-Abr 2026'!BG53+'Mai-Ago 2026'!BG53+'Set-Dez 2026'!BG53+'Jan-Abr 2027'!BG53+'Mai-Ago 2027'!BG53","v":0},{"$f":"'Jan-Abr 2025'!BG53","v":0},{"$nulls":3},0,0,0,null,0,0,0,0,0,{"$f":"'Jan-Abr 2025'!BU53+'Mai-Ago 2025'!BU53+'Set-Dez 2025'!BU53+'Jan-Abr 2026'!BU53+'Mai-Ago 2026'!BU53+'Set-Dez 2026'!BU53+'Jan-Abr 2027'!BU53+'Mai-Ago 2027'!BU53","v":0},{"$f":"'Jan-Abr 2025'!BU53","v":0}]
["16h50 - 17h40",{"$nulls":35},0,0,0,null,0,0,0,0,0,{"$f":"'Jan-Abr 2025'!AS54+'Mai-Ago 2025'!AS54+'Set-Dez 2025'!AS54+'Jan-Abr 2026'!AS54+'Mai-Ago 2026'!AS54+'Set-Dez 2026'!AS54+'Jan-Abr 2027'!AS54+'Mai-Ago 2027'!AS54","v":0},{"$f":"'Jan-Abr 2025'!AS54","v":0},{"$nulls":3},0,0,0,null,0,0,0,0,0,{"$f":"'Jan-Abr 2025'!BG54+'Mai-Ago 2025'!BG54+'Set-Dez 2025'!BG54+'Jan-Abr 2026'!BG54+'Mai-Ago 2026'!BG54+'Set-Dez 2026'!BG54+'Jan-Abr 2027'!BG54+'Mai-Ago 2027'!BG54","v":0},{"$f":"'Jan-Abr 2025'!BG54","v":0},{"$nulls":3},0,0,0,null,0,0,0,0,0,{"$f":"'Jan-Abr 2025'!BU54+'Mai-Ago 2025'!BU54+'Set-Dez 2025'!BU54+'Jan-Abr 2026'!BU54+'Mai-Ago 2026'!BU54+'Set-Dez 2026'!BU54+'Jan-Abr 2027'!BU54+'Mai-Ago 2027'!BU54","v":0},{"$f":"'Jan-Abr 2025'!BU54","v":0}]
[{"$nulls":32},"Fim",null,null,"PCT",0,0,0,560,0,0,0,0,0,{"$f":"'Jan-Abr 2025'!AS55+'Mai-Ago 2025'!AS55+'Set-Dez 2025'!AS55+'Jan-Abr 2026'!AS55+'Mai-Ago 2026'!AS55+'Set-Dez 2026'!AS55+'Jan-Abr 2027'!AS55+'Mai-Ago 2027'!AS55","v":0},{"$f":"'Jan-Abr 2025'!AS55","v":0},{"$nulls":3},0,0,0,null,0,0,0,0,0,{"$f":"'Jan-Abr 2025'!BG55+'Mai-Ago 2025'!BG55+'Set-Dez 2025'!BG55+'Jan-Abr 2026'!BG55+'Mai-Ago 2026'!BG55+'Set-Dez 2026'!BG55+'Jan-Abr 2027'!BG55+'Mai-Ago 2027'!BG55","v":0},{"$f":"'Jan-Abr 2025'!BG55","v":0},{"$nulls":3},0,0,0,null,0,0,0,0,0,{"$f":"'Jan-Abr 2025'!BU55+'Mai-Ago 2025'!BU55+'Set-Dez 2025'!BU55+'Jan-Abr 2026'!BU55+'Mai-Ago 2026'!BU55+'Set-Dez 2026'!BU55+'Jan-Abr 2027'!BU55+'Mai-Ago 2027'!BU55","v":0},{"$f":"'Jan-Abr 2025'!BU55","v":0}]
["Sociocultural",5146,"IGO","Introdução à Gestão das Organizações",{"$nulls":5},"B153",25,{"$nulls":7},6418,"OEM","Órgãos e Elementos de Máquinas",{"$nulls":5},"C591",50,{"$nulls":8},0,0,0,null,0,0,0,0,0,{"$f":"'Jan-Abr 2025'!AS56+'Mai-Ago 2025'!AS56+'Set-Dez 2025'!AS56+'Jan-Abr 2026'!AS56+'Mai-Ago 2026'!AS56+'Set-Dez 2026'!AS56+'Jan-Abr 2027'!AS56+'Mai-Ago 2027'!AS56","v":0},{"$f":"'Jan-Abr 2025'!AS56","v":0},{"$nulls":3},0,0,0,null,0,0,0,0,0,{"$f":"'Jan-Abr 2025'!BG56+'Mai-Ago 2025'!BG56+'Set-Dez 2025'!BG56+'Jan-Abr 2026'!BG56+'Mai-Ago 2026'!BG56+'Set-Dez 2026'!BG56+'Jan-Abr 2027'!BG56+'Mai-Ago 2027'!BG56","v":0},{"$f":"'Jan-Abr 2025'!BG56","v":0},{"$nulls":3},0,0,0,null,0,0,0,0,0,{"$f":"'Jan-Abr 2025'!BU56+'Mai-Ago 2025'!BU56+'Set-Dez 2025'!BU56+'Jan-Abr 2026'!BU56+'Mai-Ago 2026'!BU56+'Set-Dez 2026'!BU56+'Jan-Abr 2027'!BU56+'Mai-Ago 2027'!BU56","v":0},{"$f":"'Jan-Abr 2025'!BU56","v":0}]
[null,5152,"GMQ","Gestão e Motivação para a Qualidade",{"$nulls":5},"B155",25,{"$nulls":7},"6442","GP","Gestão de Projetos",{"$nulls":6},50,{"$nulls":8},0,0,0,null,0,0,0,0,0,{"$f":"'Jan-Abr 2025'!AS57+'Mai-Ago 2025'!AS57+'Set-Dez 2025'!AS57+'Jan-Abr 2026'!AS57+'Mai-Ago 2026'!AS57+'Set-Dez 2026'!AS57+'Jan-Abr 2027'!AS57+'Mai-Ago 2027'!AS57","v":0},{"$f":"'Jan-Abr 2025'!AS57","v":0},{"$nulls":3},0,0,0,null,0,0,0,0,0,{"$f":"'Jan-Abr 2025'!BG57+'Mai-Ago 2025'!BG57+'Set-Dez 2025'!BG57+'Jan-Abr 2026'!BG57+'Mai-Ago 2026'!BG57+'Set-Dez 2026'!BG57+'Jan-Abr 2027'!BG57+'Mai-Ago 2027'!BG57","v":0},{"$f":"'Jan-Abr 2025'!BG57","v":0},{"$nulls":3},0,0,0,null,0,0,0,0,0,{"$f":"'Jan-Abr 2025'!BU57+'Mai-Ago 2025'!BU57+'Set-Dez 2025'!BU57+'Jan-Abr 2026'!BU57+'Mai-Ago 2026'!BU57+'Set-Dez 2026'!BU57+'Jan-Abr 2027'!BU57+'Mai-Ago 2027'!BU57","v":0},{"$f":"'Jan-Abr 2025'!BU57","v":0}]
[null,5149,"SGQ","Sistama de Gestão da Qualidade ISO 9001",{"$nulls":5},"F369",25,{"$nulls":7},"6443","PP","Planeamento da Produção",{"$nulls":6},50,{"$nulls":8},0,0,0,null,0,0,0,0,0,{"$f":"'Jan-Abr 2025'!AS58+'Mai-Ago 2025'!AS58+'Set-Dez 2025'!AS58+'Jan-Abr 2026'!AS58+'Mai-Ago 2026'!AS58+'Set-Dez 2026'!AS58+'Jan-Abr 2027'!AS58+'Mai-Ago 2027'!AS58","v":0},{"$f":"'Jan-Abr 2025'!AS58","v":0},{"$nulls":3},0,0,0,null,0,0,0,0,0,{"$f":"'Jan-Abr 2025'!BG58+'Mai-Ago 2025'!BG58+'Set-Dez 2025'!BG58+'Jan-Abr 2026'!BG58+'Mai-Ago 2026'!BG58+'Set-Dez 2026'!BG58+'Jan-Abr 2027'!BG58+'Mai-Ago 2027'!BG58","v":0},{"$f":"'Jan-Abr 2025'!BG58","v":0},{"$nulls":3},0,0,0,null,0,0,0,0,0,{"$f":"'Jan-Abr 2025'!BU58+'Mai-Ago 2025'!BU58+'Set-Dez 2025'!BU58+'Jan-Abr 2026'!BU58+'Mai-Ago 2026'!BU58+'Set-Dez 2026'!BU58+'Jan-Abr 2027'!BU58+'Mai-Ago 2027'!BU58","v":0},{"$f":"'Jan-Abr 2025'!BU58","v":0}]
[null,349,"ASHST","Ambiente, Segurança, Higiene e Saúde no Trabalho",{"$nulls":5},"F423",25,{"$nulls":7},"6444","GS","Gestão de Stocks - Metodologias",{"$nulls":6},50,{"$nulls":8},0,0,0,null,0,0,0,0,0,{"$f":"'Jan-Abr 2025'!AS59+'Mai-Ago 2025'!AS59+'Set-Dez 2025'!AS59+'Jan-Abr 2026'!AS59+'Mai-Ago 2026'!AS59+'Set-Dez 2026'!AS59+'Jan-Abr 2027'!AS59+'Mai-Ago 2027'!AS59","v":0},{"$f":"'Jan-Abr 2025'!AS59","v":0},{"$nulls":3},0,0,0,null,0,0,0,0,0,{"$f":"'Jan-Abr 2025'!BG59+'Mai-Ago 2025'!BG59+'Set-Dez 2025'!BG59+'Jan-Abr 2026'!BG59+'Mai-Ago 2026'!BG59+'Set-Dez 2026'!BG59+'Jan-Abr 2027'!BG59+'Mai-Ago 2027'!BG59","v":0},{"$f":"'Jan-Abr 2025'!BG59","v":0},{"$nulls":3},0,0,0,null,0,0,0,0,0,{"$f":"'Jan-Abr 2025'!BU59+'Mai-Ago 2025'!BU59+'Set-Dez 2025'!BU59+'Jan-Abr 2026'!BU59+'Mai-Ago 2026'!BU59+'Set-Dez 2026'!BU59+'Jan-Abr 2027'!BU59+'Mai-Ago 2027'!BU59","v":0},{"$f":"'Jan-Abr 2025'!BU59","v":0}]
[null,5653,"DT","Direito do Trabalho",{"$nulls":5},"B154",25,{"$nulls":7},"1054","CGO","Custeio e Gestão Orçamental",{"$nulls":6},50,{"$nulls":8},0,0,0,null,0,0,0,0,0,{"$f":"'Jan-Abr 2025'!AS60+'Mai-Ago 2025'!AS60+'Set-Dez 2025'!AS60+'Jan-Abr 2026'!AS60+'Mai-Ago 2026'!AS60+'Set-Dez 2026'!AS60+'Jan-Abr 2027'!AS60+'Mai-Ago 2027'!AS60","v":0},{"$f":"'Jan-Abr 2025'!AS60","v":0},{"$nulls":3},0,0,0,null,0,0,0,0,0,{"$f":"'Jan-Abr 2025'!BG60+'Mai-Ago 2025'!BG60+'Set-Dez 2025'!BG60+'Jan-Abr 2026'!BG60+'Mai-Ago 2026'!BG60+'Set-Dez 2026'!BG60+'Jan-Abr 2027'!BG60+'Mai-Ago 2027'!BG60","v":0},{"$f":"'Jan-Abr 2025'!BG60","v":0},{"$nulls":3},0,0,0,null,0,0,0,0,0,{"$f":"'Jan-Abr 2025'!BU60+'Mai-Ago 2025'!BU60+'Set-Dez 2025'!BU60+'Jan-Abr 2026'!BU60+'Mai-Ago 2026'!BU60+'Set-Dez 2026'!BU60+'Jan-Abr 2027'!BU60+'Mai-Ago 2027'!BU60","v":0},{"$f":"'Jan-Abr 2025'!BU60","v":0}]
[null,5768,"ICS","Inglês em Contexto Socioprofissional",{"$nulls":5},"L046",25,{"$nulls":7},"6445","LOG","Logistica ",{"$nulls":6},50,{"$nulls":8},0,0,0,null,0,0,0,0,0,{"$f":"'Jan-Abr 2025'!AS61+'Mai-Ago 2025'!AS61+'Set-Dez 2025'!AS61+'Jan-Abr 2026'!AS61+'Mai-Ago 2026'!AS61+'Set-Dez 2026'!AS61+'Jan-Abr 2027'!AS61+'Mai-Ago 2027'!AS61","v":0},{"$f":"'Jan-Abr 2025'!AS61","v":0},{"$nulls":3},0,0,0,null,0,0,0,0,0,{"$f":"'Jan-Abr 2025'!BG61+'Mai-Ago 2025'!BG61+'Set-Dez 2025'!BG61+'Jan-Abr 2026'!BG61+'Mai-Ago 2026'!BG61+'Set-Dez 2026'!BG61+'Jan-Abr 2027'!BG61+'Mai-Ago 2027'!BG61","v":0},{"$f":"'Jan-Abr 2025'!BG61","v":0},{"$nulls":3},0,0,0,null,0,0,0,0,0,{"$f":"'Jan-Abr 2025'!BU61+'Mai-Ago 2025'!BU61+'Set-Dez 2025'!BU61+'Jan-Abr 2026'!BU61+'Mai-Ago 2026'!BU61+'Set-Dez 2026'!BU61+'Jan-Abr 2027'!BU61+'Mai-Ago 2027'!BU61","v":0},{"$f":"'Jan-Abr 2025'!BU61","v":0}]
[{"$nulls":18},"6446","MOT","Métodos e Organização do Trabalho",{"$nulls":6},50,{"$nulls":8},0,0,0,null,0,0,0,0,0,{"$f":"'Jan-Abr 2025'!AS62+'Mai-Ago 2025'!AS62+'Set-Dez 2025'!AS62+'Jan-Abr 2026'!AS62+'Mai-Ago 2026'!AS62+'Set-Dez 2026'!AS62+'Jan-Abr 2027'!AS62+'Mai-Ago 2027'!AS62","v":0},{"$f":"'Jan-Abr 2025'!AS62","v":0},{"$nulls":3},0,0,0,null,0,0,0,0,0,{"$f":"'Jan-Abr 2025'!BG62+'Mai-Ago 2025'!BG62+'Set-Dez 2025'!BG62+'Jan-Abr 2026'!BG62+'Mai-Ago 2026'!BG62+'Set-Dez 2026'!BG62+'Jan-Abr 2027'!BG62+'Mai-Ago 2027'!BG62","v":0},{"$f":"'Jan-Abr 2025'!BG62","v":0},{"$nulls":3},0,0,0,null,0,0,0,0,0,{"$f":"'Jan-Abr 2025'!BU62+'Mai-Ago 2025'!BU62+'Set-Dez 2025'!BU62+'Jan-Abr 2026'!BU62+'Mai-Ago 2026'!BU62+'Set-Dez 2026'!BU62+'Jan-Abr 2027'!BU62+'Mai-Ago 2027'!BU62","v":0},{"$f":"'Jan-Abr 2025'!BU62","v":0}]
[{"$nulls":18},"6447","SGI","Sistema de Gestão Integrada",{"$nulls":6},25,{"$nulls":8},0,0,0,null,0,0,0,0,0,{"$f":"'Jan-Abr 2025'!AS63+'Mai-Ago 2025'!AS63+'Set-Dez 2025'!AS63+'Jan-Abr 2026'!AS63+'Mai-Ago 2026'!AS63+'Set-Dez 2026'!AS63+'Jan-Abr 2027'!AS63+'Mai-Ago 2027'!AS63","v":0},{"$f":"'Jan-Abr 2025'!AS63","v":0},{"$nulls":3},0,0,0,null,{"$f":"COUNTIF($C$10:$AG$18,$AX63)","v":0},{"$f":"COUNTIF($C$22:$AG$30,$AX63)","v":0},{"$f":"COUNTIF($C$34:$AG$42,$AX63)","v":0},{"$f":"COUNTIF($C$46:$AG$54,$AX63)","v":0},0,{"$f":"'Jan-Abr 2025'!BG63+'Mai-Ago 2025'!BG63+'Set-Dez 2025'!BG63+'Jan-Abr 2026'!BG63+'Mai-Ago 2026'!BG63+'Set-Dez 2026'!BG63+'Jan-Abr 2027'!BG63+'Mai-Ago 2027'!BG63","v":0},{"$f":"'Jan-Abr 2025'!BG63","v":0},{"$nulls":3},0,0,0,null,0,0,0,0,0,{"$f":"'Jan-Abr 2025'!BU63+'Mai-Ago 2025'!BU63+'Set-Dez 2025'!BU63+'Jan-Abr 2026'!BU63+'Mai-Ago 2026'!BU63+'Set-Dez 2026'!BU63+'Jan-Abr 2027'!BU63+'Mai-Ago 2027'!BU63","v":0},{"$f":"'Jan-Abr 2025'!BU63","v":0}]
["Tecnológica",6407,"PFL","Processos de Fundição / Ligação",{"$nulls":5},"D333",25,{"$nulls":7},"6448","QCEP","Qualidade - controlo estatístico de processo",{"$nulls":6},50,{"$nulls":8},0,0,0,null,0,0,0,0,0,{"$f":"'Jan-Abr 2025'!AS64+'Mai-Ago 2025'!AS64+'Set-Dez 2025'!AS64+'Jan-Abr 2026'!AS64+'Mai-Ago 2026'!AS64+'Set-Dez 2026'!AS64+'Jan-Abr 2027'!AS64+'Mai-Ago 2027'!AS64","v":0},{"$f":"'Jan-Abr 2025'!AS64","v":0},{"$nulls":3},0,0,0,null,0,0,0,0,0,{"$f":"'Jan-Abr 2025'!BG64+'Mai-Ago 2025'!BG64+'Set-Dez 2025'!BG64+'Jan-Abr 2026'!BG64+'Mai-Ago 2026'!BG64+'Set-Dez 2026'!BG64+'Jan-Abr 2027'!BG64+'Mai-Ago 2027'!BG64","v":0},{"$f":"'Jan-Abr 2025'!BG64","v":0},{"$nulls":3},0,0,0,null,0,0,0,0,0,{"$f":"'Jan-Abr 2025'!BU64+'Mai-Ago 2025'!BU64+'Set-Dez 2025'!BU64+'Jan-Abr 2026'!BU64+'Mai-Ago 2026'!BU64+'Set-Dez 2026'!BU64+'Jan-Abr 2027'!BU64+'Mai-Ago 2027'!BU64","v":0},{"$f":"'Jan-Abr 2025'!BU64","v":0}]
[null,6408,"PCC","Processos de Conformação / Corte",{"$nulls":5},"D334",25,{"$nulls":25},0,0,0,null,0,0,0,0,0,{"$f":"'Jan-Abr 2025'!AS65+'Mai-Ago 2025'!AS65+'Set-Dez 2025'!AS65+'Jan-Abr 2026'!AS65+'Mai-Ago 2026'!AS65+'Set-Dez 2026'!AS65+'Jan-Abr 2027'!AS65+'Mai-Ago 2027'!AS65","v":0},{"$f":"'Jan-Abr 2025'!AS65","v":0},{"$nulls":3},0,0,0,null,0,0,0,0,0,{"$f":"'Jan-Abr 2025'!BG65+'Mai-Ago 2025'!BG65+'Set-Dez 2025'!BG65+'Jan-Abr 2026'!BG65+'Mai-Ago 2026'!BG65+'Set-Dez 2026'!BG65+'Jan-Abr 2027'!BG65+'Mai-Ago 2027'!BG65","v":0},{"$f":"'Jan-Abr 2025'!BG65","v":0},{"$nulls":3},0,0,0,null,0,0,0,{"$f":"COUNTIF($C$46:$AG$54,$BL65)","v":0},0,{"$f":"'Jan-Abr 2025'!BU65+'Mai-Ago 2025'!BU65+'Set-Dez 2025'!BU65+'Jan-Abr 2026'!BU65+'Mai-Ago 2026'!BU65+'Set-Dez 2026'!BU65+'Jan-Abr 2027'!BU65+'Mai-Ago 2027'!BU65","v":0},{"$f":"'Jan-Abr 2025'!BU65","v":0}]
[null,6409,"PAA","Processos por Arranque de Apara",{"$nulls":5},"C588",25,{"$nulls":25},0,0,0,null,0,0,0,0,0,{"$f":"'Jan-Abr 2025'!AS66+'Mai-Ago 2025'!AS66+'Set-Dez 2025'!AS66+'Jan-Abr 2026'!AS66+'Mai-Ago 2026'!AS66+'Set-Dez 2026'!AS66+'Jan-Abr 2027'!AS66+'Mai-Ago 2027'!AS66","v":0},{"$f":"'Jan-Abr 2025'!AS66","v":0},{"$nulls":3},0,0,0,null,0,0,0,0,0,{"$f":"'Jan-Abr 2025'!BG66+'Mai-Ago 2025'!BG66+'Set-Dez 2025'!BG66+'Jan-Abr 2026'!BG66+'Mai-Ago 2026'!BG66+'Set-Dez 2026'!BG66+'Jan-Abr 2027'!BG66+'Mai-Ago 2027'!BG66","v":0},{"$f":"'Jan-Abr 2025'!BG66","v":0},{"$nulls":3},0,0,0,null,0,0,0,0,0,{"$f":"'Jan-Abr 2025'!BU66+'Mai-Ago 2025'!BU66+'Set-Dez 2025'!BU66+'Jan-Abr 2026'!BU66+'Mai-Ago 2026'!BU66+'Set-Dez 2026'!BU66+'Jan-Abr 2027'!BU66+'Mai-Ago 2027'!BU66","v":0},{"$f":"'Jan-Abr 2025'!BU66","v":0}]
[null,6410,"IME","Instalação de Máquinas Elétricas",{"$nulls":5},"K252",50,{"$nulls":25},0,0,0,null,0,0,0,0,0,{"$f":"'Jan-Abr 2025'!AS67+'Mai-Ago 2025'!AS67+'Set-Dez 2025'!AS67+'Jan-Abr 2026'!AS67+'Mai-Ago 2026'!AS67+'Set-Dez 2026'!AS67+'Jan-Abr 2027'!AS67+'Mai-Ago 2027'!AS67","v":0},{"$f":"'Jan-Abr 2025'!AS67","v":0},{"$nulls":3},0,0,0,null,0,0,0,0,0,{"$f":"'Jan-Abr 2025'!BG67+'Mai-Ago 2025'!BG67+'Set-Dez 2025'!BG67+'Jan-Abr 2026'!BG67+'Mai-Ago 2026'!BG67+'Set-Dez 2026'!BG67+'Jan-Abr 2027'!BG67+'Mai-Ago 2027'!BG67","v":0},{"$f":"'Jan-Abr 2025'!BG67","v":0},{"$nulls":3},0,0,0,null,0,0,0,0,0,{"$f":"'Jan-Abr 2025'!BU67+'Mai-Ago 2025'!BU67+'Set-Dez 2025'!BU67+'Jan-Abr 2026'!BU67+'Mai-Ago 2026'!BU67+'Set-Dez 2026'!BU67+'Jan-Abr 2027'!BU67+'Mai-Ago 2027'!BU67","v":0},{"$f":"'Jan-Abr 2025'!BU67","v":0}]
[null,6411,"ELE","Eletrónica",{"$nulls":5},"K253",50,{"$nulls":25},0,0,0,null,0,0,0,0,0,{"$f":"'Jan-Abr 2025'!AS68+'Mai-Ago 2025'!AS68+'Set-Dez 2025'!AS68+'Jan-Abr 2026'!AS68+'Mai-Ago 2026'!AS68+'Set-Dez 2026'!AS68+'Jan-Abr 2027'!AS68+'Mai-Ago 2027'!AS68","v":0},{"$f":"'Jan-Abr 2025'!AS68","v":0},{"$nulls":3},0,0,0,null,0,0,0,0,0,{"$f":"'Jan-Abr 2025'!BG68+'Mai-Ago 2025'!BG68+'Set-Dez 2025'!BG68+'Jan-Abr 2026'!BG68+'Mai-Ago 2026'!BG68+'Set-Dez 2026'!BG68+'Jan-Abr 2027'!BG68+'Mai-Ago 2027'!BG68","v":0},{"$f":"'Jan-Abr 2025'!BG68","v":0},{"$nulls":3},0,0,0,null,0,0,0,0,0,{"$f":"'Jan-Abr 2025'!BU68+'Mai-Ago 2025'!BU68+'Set-Dez 2025'!BU68+'Jan-Abr 2026'!BU68+'Mai-Ago 2026'!BU68+'Set-Dez 2026'!BU68+'Jan-Abr 2027'!BU68+'Mai-Ago 2027'!BU68","v":0},{"$f":"'Jan-Abr 2025'!BU68","v":0}]
[null,6412,"CP","Circuitos Pneumáticos",{"$nulls":5},"E329",25,{"$nulls":25},0,0,0,null,0,0,0,0,0,{"$f":"'Jan-Abr 2025'!AS69+'Mai-Ago 2025'!AS69+'Set-Dez 2025'!AS69+'Jan-Abr 2026'!AS69+'Mai-Ago 2026'!AS69+'Set-Dez 2026'!AS69+'Jan-Abr 2027'!AS69+'Mai-Ago 2027'!AS69","v":0},{"$f":"'Jan-Abr 2025'!AS69","v":0},{"$nulls":3},0,0,0,null,0,0,0,0,0,{"$f":"'Jan-Abr 2025'!BG69+'Mai-Ago 2025'!BG69+'Set-Dez 2025'!BG69+'Jan-Abr 2026'!BG69+'Mai-Ago 2026'!BG69+'Set-Dez 2026'!BG69+'Jan-Abr 2027'!BG69+'Mai-Ago 2027'!BG69","v":0},{"$f":"'Jan-Abr 2025'!BG69","v":0},{"$nulls":3},0,0,0,null,0,0,0,0,0,{"$f":"'Jan-Abr 2025'!BU69+'Mai-Ago 2025'!BU69+'Set-Dez 2025'!BU69+'Jan-Abr 2026'!BU69+'Mai-Ago 2026'!BU69+'Set-Dez 2026'!BU69+'Jan-Abr 2027'!BU69+'Mai-Ago 2027'!BU69","v":0},{"$f":"'Jan-Abr 2025'!BU69","v":0}]
[null,6413,"CH","Circuitos Óleo-Hidráulicos",{"$nulls":5},"E330",25,{"$nulls":6},"Estágio",null,"PCT","Prática em Contexto Trabalho",{"$nulls":5},"E368",560,{"$nulls":8},0,0,0,null,0,0,0,0,0,{"$f":"'Jan-Abr 2025'!AS70+'Mai-Ago 2025'!AS70+'Set-Dez 2025'!AS70+'Jan-Abr 2026'!AS70+'Mai-Ago 2026'!AS70+'Set-Dez 2026'!AS70+'Jan-Abr 2027'!AS70+'Mai-Ago 2027'!AS70","v":0},{"$f":"'Jan-Abr 2025'!AS70","v":0},{"$nulls":3},0,0,0,null,0,0,0,0,0,{"$f":"'Jan-Abr 2025'!BG70+'Mai-Ago 2025'!BG70+'Set-Dez 2025'!BG70+'Jan-Abr 2026'!BG70+'Mai-Ago 2026'!BG70+'Set-Dez 2026'!BG70+'Jan-Abr 2027'!BG70+'Mai-Ago 2027'!BG70","v":0},{"$f":"'Jan-Abr 2025'!BG70","v":0},{"$nulls":3},0,0,0,null,0,0,0,0,0,{"$f":"'Jan-Abr 2025'!BU70+'Mai-Ago 2025'!BU70+'Set-Dez 2025'!BU70+'Jan-Abr 2026'!BU70+'Mai-Ago 2026'!BU70+'Set-Dez 2026'!BU70+'Jan-Abr 2027'!BU70+'Mai-Ago 2027'!BU70","v":0},{"$f":"'Jan-Abr 2025'!BU70","v":0}]
[null,6414,"CLP","Controladores Lógicos Programáveis",{"$nulls":5},"C589",50,{"$nulls":25},0,0,0,null,0,0,0,0,0,{"$f":"'Jan-Abr 2025'!AS71+'Mai-Ago 2025'!AS71+'Set-Dez 2025'!AS71+'Jan-Abr 2026'!AS71+'Mai-Ago 2026'!AS71+'Set-Dez 2026'!AS71+'Jan-Abr 2027'!AS71+'Mai-Ago 2027'!AS71","v":0},{"$f":"'Jan-Abr 2025'!AS71","v":0},{"$nulls":3},0,0,0,null,0,0,0,0,0,{"$f":"'Jan-Abr 2025'!BG71+'Mai-Ago 2025'!BG71+'Set-Dez 2025'!BG71+'Jan-Abr 2026'!BG71+'Mai-Ago 2026'!BG71+'Set-Dez 2026'!BG71+'Jan-Abr 2027'!BG71+'Mai-Ago 2027'!BG71","v":0},{"$f":"'Jan-Abr 2025'!BG71","v":0},{"$nulls":3},0,0,0,null,0,0,0,0,0,{"$f":"'Jan-Abr 2025'!BU71+'Mai-Ago 2025'!BU71+'Set-Dez 2025'!BU71+'Jan-Abr 2026'!BU71+'Mai-Ago 2026'!BU71+'Set-Dez 2026'!BU71+'Jan-Abr 2027'!BU71+'Mai-Ago 2027'!BU71","v":0},{"$f":"'Jan-Abr 2025'!BU71","v":0}]
[null,6415,"DCM","Desenho de Construções Mecânicas",{"$nulls":5},"A438",50,{"$nulls":25},{"$f":"IF(AI72=$DC$8,AM72,IF(AI72=$DC$9,AM72,IF(AI72=$DC$10,AL72,)))","v":0},0,{"$f":"IF(AI72=$DC$8,AL72,IF(AI72=$DC$9,AM73+AL72,IF(AI72=$DC$10,IF(AI73=$DC$10,AM73+AL72,AL72),)))","v":0},null,0,0,0,0,{"$f":"SUM(AO72:AR72)","v":0},{"$f":"'Jan-Abr 2025'!AS72+'Mai-Ago 2025'!AS72+'Set-Dez 2025'!AS72+'Jan-Abr 2026'!AS72+'Mai-Ago 2026'!AS72+'Set-Dez 2026'!AS72+'Jan-Abr 2027'!AS72+'Mai-Ago 2027'!AS72","v":0},{"$f":"'Jan-Abr 2025'!AS72","v":0},{"$nulls":3},{"$f":"IF(AW72=$DC$8,BA72,IF(AW72=$DC$9,BA72,IF(AW72=$DC$10,AZ72,)))","v":0},0,{"$f":"IF(AW72=$DC$8,AZ72,IF(AW72=$DC$9,BA73+AZ72,IF(AW72=$DC$10,IF(AW73=$DC$10,BA73+AZ72,AZ72),)))","v":0},null,0,0,0,0,{"$f":"SUM(BC72:BF72)","v":0},{"$f":"'Jan-Abr 2025'!BG72+'Mai-Ago 2025'!BG72+'Set-Dez 2025'!BG72+'Jan-Abr 2026'!BG72+'Mai-Ago 2026'!BG72+'Set-Dez 2026'!BG72+'Jan-Abr 2027'!BG72+'Mai-Ago 2027'!BG72","v":0},{"$f":"'Jan-Abr 2025'!BG72","v":0},{"$nulls":3},{"$f":"IF(BK72=$DC$8,BO72,IF(BK72=$DC$9,BO72,IF(BK72=$DC$10,BN72,)))","v":0},0,{"$f":"IF(BK72=$DC$8,BN72,IF(BK72=$DC$9,BO73+BN72,IF(BK72=$DC$10,IF(BK73=$DC$10,BO73+BN72,BN72),)))","v":0},null,0,0,0,0,{"$f":"SUM(BQ72:BT72)","v":0},{"$f":"'Jan-Abr 2025'!BU72+'Mai-Ago 2025'!BU72+'Set-Dez 2025'!BU72+'Jan-Abr 2026'!BU72+'Mai-Ago 2026'!BU72+'Set-Dez 2026'!BU72+'Jan-Abr 2027'!BU72+'Mai-Ago 2027'!BU72","v":0},{"$f":"'Jan-Abr 2025'!BU72","v":0}]
[null,6416,"CM","Ciência dos Materiais",{"$nulls":5},"C590",50,{"$nulls":25},0,{"$f":"IF($AK$4=$DB$8,AS73,IF($AK$4=$DB$9,AT73,IF($AK$4=$DB$10,AU73,IF($AK$4=$DB$11,AO73,IF($AK$4=$DB$12,AP73,IF($AK$4=$DB$13,AQ73,IF($AK$4=$DB$14,AR73,\"\")))))))","v":0},0,null,{"$f":"COUNTIF($C$10:$AG$18,$AJ73)","v":0},{"$f":"COUNTIF($C$22:$AG$30,$AJ73)","v":0},{"$f":"COUNTIF($C$34:$AG$42,$AJ73)","v":0},{"$f":"COUNTIF($C$46:$AG$54,$AJ73)","v":0},0,{"$f":"'Jan-Abr 2025'!AS73+'Mai-Ago 2025'!AS73+'Set-Dez 2025'!AS73+'Jan-Abr 2026'!AS73+'Mai-Ago 2026'!AS73+'Set-Dez 2026'!AS73+'Jan-Abr 2027'!AS73+'Mai-Ago 2027'!AS73","v":0},{"$f":"'Jan-Abr 2025'!AS73","v":0},{"$nulls":3},0,{"$f":"IF($AK$4=$DB$8,BG73,IF($AK$4=$DB$9,BH73,IF($AK$4=$DB$10,BI73,IF($AK$4=$DB$11,BC73,IF($AK$4=$DB$12,BD73,IF($AK$4=$DB$13,BE73,IF($AK$4=$DB$14,BF73,\"\")))))))","v":0},0,null,{"$f":"COUNTIF($C$10:$AG$18,$AX73)","v":0},{"$f":"COUNTIF($C$22:$AG$30,$AX73)","v":0},{"$f":"COUNTIF($C$34:$AG$42,$AX73)","v":0},{"$f":"COUNTIF($C$46:$AG$54,$AX73)","v":0},0,{"$f":"'Jan-Abr 2025'!BG73+'Mai-Ago 2025'!BG73+'Set-Dez 2025'!BG73+'Jan-Abr 2026'!BG73+'Mai-Ago 2026'!BG73+'Set-Dez 2026'!BG73+'Jan-Abr 2027'!BG73+'Mai-Ago 2027'!BG73","v":0},{"$f":"'Jan-Abr 2025'!BG73","v":0},{"$nulls":3},{"$f":"IF(BK73=$DC$8,BO73,IF(BK73=$DC$9,BO73,IF(BK73=$DC$10,BN73,)))","v":0},{"$f":"IF($AK$4=$DB$8,BU73,IF($AK$4=$DB$9,BV73,IF($AK$4=$DB$10,BW73,IF($AK$4=$DB$11,BQ73,IF($AK$4=$DB$12,BR73,IF($AK$4=$DB$13,BS73,IF($AK$4=$DB$14,BT73,\"\")))))))","v":0},0,null,{"$f":"COUNTIF($C$10:$AG$18,$BL73)","v":0},{"$f":"COUNTIF($C$22:$AG$30,$BL73)","v":0},{"$f":"COUNTIF($C$34:$AG$42,$BL73)","v":0},{"$f":"COUNTIF($C$46:$AG$54,$BL73)","v":0},0,{"$f":"'Jan-Abr 2025'!BU73+'Mai-Ago 2025'!BU73+'Set-Dez 2025'!BU73+'Jan-Abr 2026'!BU73+'Mai-Ago 2026'!BU73+'Set-Dez 2026'!BU73+'Jan-Abr 2027'!BU73+'Mai-Ago 2027'!BU73","v":0},{"$f":"'Jan-Abr 2025'!BU73","v":0}]
[null,6417,"SD","Sistemas Digitais",{"$nulls":5},"I159",50,{"$nulls":9},"Seg.","Ter.","Qua.","Qui.","Sex."]
[{"$nulls":19},"Salas:",{"$nulls":16},{"$f":"SUMIF(AI8:AI73,\"=M\",AK8:AK73)+SUMIF(AI8:AI73,\"=T\",AK8:AK73)","v":0},null,null,{"$f":"SUMIF(AI8:AI73,\"=M\",AN8:AN73)+SUMIF(AI8:AI73,\"=T\",AN8:AN73)","v":0},{"$nulls":10},{"$f":"SUMIF(AW8:AW73,\"=M\",AY8:AY73)+SUMIF(AW8:AW73,\"=T\",AY8:AY73)","v":0},null,null,{"$f":"SUMIF(AW8:AW73,\"=M\",BB8:BB73)+SUMIF(AW8:AW73,\"=T\",BB8:BB73)","v":0},{"$nulls":10},{"$f":"SUMIF(BK8:BK73,\"=M\",BM8:BM73)+SUMIF(BK8:BK73,\"=T\",BM8:BM73)","v":0},null,null,{"$f":"SUMIF(BK8:BK73,\"=M\",BP8:BP73)+SUMIF(BK8:BK73,\"=T\",BP8:BP73)","v":0}]
[{"$nulls":34},"Totais",null,{"$f":"AK75+AY75+BM75","v":0},null,null,{"$f":"AN75+BB75+BP75","v":0}]
["R. Quantitativas:"]

{"sheet":"Mai-Ago 2025","index":2,"n_rows":77,"n_cols":107,"rows_kept":77,"merged":[[0,25,0,32],[0,34,2,39],[0,40,6,40],[0,41,6,41],[0,42,6,42],[0,43,6,43],[0,44,6,44],[0,45,6,45],[0,46,6,46],[0,48,2,53],[0,54,6,54],[0,55,6,55],[0,56,6,56],[0,57,6,57],[0,58,6,58],[0,59,6,59],[0,60,6,60],[0,62,2,67],[0,68,6,68],[0,69,6,69],[0,70,6,70],[0,71,6,71],[0,72,6,72],[0,73,6,73],[0,74,6,74],[0,105,6,105],[0,106,6,106],[1,25,1,32],[2,25,2,32],[3,25,3,32],[3,34,6,34],[3,35,6,35],[3,36,6,36],[3,37,6,37],[3,38,6,38],[3,39,6,39],[3,48,6,48],[3,49,6,49],[3,50,6,50],[3,51,6,51],[3,52,6,52],[3,53,6,53],[3,62,6,62],[3,63,6,63],[3,64,6,64],[3,65,6,65],[3,66,6,66],[3,67,6,67],[4,0,4,2],[4,3,4,9],[4,10,4,13],[4,14,4,21],[4,22,4,26],[4,27,4,29],[4,30,4,32],[5,0,5,2],[5,3,5,9],[5,10,5,13],[5,14,5,21],[5,22,5,26],[5,27,5,29],[5,30,5,32],[6,0,6,2],[6,3,6,9],[6,10,6,13],[6,14,6,21],[6,22,6,26],[6,27,6,29],[6,30,6,32],[7,0,8,1],[9,0,9,1],[10,0,10,1],[11,0,11,1],[12,0,12,1],[14,0,14,1],[15,0,15,1],[16,0,16,1],[17,0,17,1],[19,0,20,1],[21,0,21,1],[22,0,22,1],[23,0,23,1],[24,0,24,1],[25,0,25,1],[26,0,26,1],[27,0,27,1],[28,0,28,1],[29,0,29,1],[31,0,32,1],[33,0,33,1],[34,0,34,1],[35,0,35,1],[36,0,36,1],[37,0,37,1],[38,0,38,1],[39,0,39,1],[40,0,40,1],[41,0,41,1],[43,0,44,1],[45,0,45,1],[46,0,46,1],[47,0,47,1],[48,0,48,1],[49,0,49,1],[50,0,50,1],[51,0,51,1],[52,0,52,1],[53,0,53,1],[54,2,54,8],[54,11,54,13],[54,17,54,19],[54,20,54,25],[54,28,54,30],[55,0,60,0],[55,3,55,8],[55,11,55,13],[55,17,63,17],[55,20,55,25],[55,28,55,30],[56,3,56,8],[56,11,56,13],[56,20,56,25],[56,28,56,30],[57,3,57,8],[57,11,57,13],[57,20,57,25],[57,28,57,30],[58,3,58,8],[58,11,58,13],[58,20,58,25],[58,28,58,30],[59,3,59,8],[59,11,59,13],[59,20,59,25],[59,28,59,30],[60,3,60,8],[60,11,60,13],[60,20,60,25],[60,28,60,30],[61,20,61,25],[61,28,61,30],[62,20,62,25],[63,0,73,0],[63,3,63,8],[63,11,63,13],[63,20,63,25],[64,3,64,8],[64,11,64,13],[65,3,65,8],[65,11,65,13],[66,3,66,8],[66,11,66,13],[67,3,67,8],[67,11,67,13],[68,3,68,8],[68,11,68,13],[69,3,69,8],[69,11,69,13],[70,3,70,8],[70,11,70,13],[71,3,71,8],[71,11,71,13],[72,3,72,8],[72,11,72,13],[73,3,73,8],[73,11,73,13],[75,34,75,35],[76,2,76,3],[76,4,76,5],[76,6,76,7],[76,8,76,9],[76,10,76,11],[76,12,76,13]]}
[{"$nulls":40},{"$f":"TEXT($A$8,\"mmm\")","v":"mai"},{"$f":"TEXT($A$20,\"mmm\")","v":"jun"},{"$f":"TEXT($A$32,\"mmm\")","v":"jul"},{"$f":"TEXT($A$44,\"mmm\")","v":"ago"},"Total  Folha","Total Global","Total  Acum.",{"$nulls":7},{"$f":"TEXT($A$8,\"mmm\")","v":"mai"},{"$f":"TEXT($A$20,\"mmm\")","v":"jun"},{"$f":"TEXT($A$32,\"mmm\")","v":"jul"},{"$f":"TEXT($A$44,\"mmm\")","v":"ago"},"Total  Folha","Total Global","Total  Acum.",{"$nulls":7},{"$f":"TEXT($A$8,\"mmm\")","v":"mai"},{"$f":"TEXT($A$20,\"mmm\")","v":"jun"},{"$f":"TEXT($A$32,\"mmm\")","v":"jul"},{"$f":"TEXT($A$44,\"mmm\")","v":"ago"},"Total  Folha","Total Global","Total  Acum.",{"$nulls":30},"tipo_soma","tipo_contador"]
[{"$nulls":25},"Director(a):"]
[{"$nulls":25},"(Cristina Botas)"]
[{"$nulls":34},"Tipo","Módulo","ST","Origem","Cálculo","Objetivo",{"$nulls":8},"Tipo","Módulo",{"$f":"AK4","v":"ST"},"Origem","Cálculo","Objetivo",{"$nulls":8},"Tipo","Módulo",{"$f":"AK4","v":"ST"},"Origem","Cálculo","Objetivo"]
["MODALIDADE:",{"$nulls":9},"CODÍGO DA AÇÃO:",{"$nulls":16},"       U.O.:",null,null,"Torres Vedras"]
["PLANEAMENTO:",{"$nulls":9},"SAÍDA PROFISSIONAL: Técnico/a Especialista em Mecatrónica",{"$nulls":16},"DATA INÍCIO:"]
["COORDENADOR:",{"$nulls":9},"DURAÇÃO:",{"$nulls":16},"DATA FIM  (previsto):"]
["2025-05-01",null,{"$f":"IF(C9<>\"\",CHOOSE(WEEKDAY(C9,1),\"Dom.\",\"Seg.\",\"Ter.\",\"Qua.\",\"Qui.\",\"Sex.\",\"Sáb.\"),\"\")","v":"Qui."},{"$f":"IF(D9<>\"\",CHOOSE(WEEKDAY(D9,1),\"Dom.\",\"Seg.\",\"Ter.\",\"Qua.\",\"Qui.\",\"Sex.\",\"Sáb.\"),\"\")","v":"Sex."},"Sáb.","Dom.","Seg.","Ter.","Qua.","Qui.","Sex.","Sáb.","Dom.","Seg.","Ter.","Qua.","Qui.","Sex.","Sáb.","Dom.","Seg.","Ter.","Qua.","Qui.","Sex.","Sáb.","Dom.","Seg.","Ter.","Qua.","Qui.","Sex.","Sáb.",null,null,"IGO",{"$f":"IF(AI8=$DC$8,AM8,IF(AI8=$DC$9,AM8,IF(AI8=$DC$10,AL8,)))","v":0},{"$f":"IF($AK$4=$DB$8,AS8,IF($AK$4=$DB$9,AT8,IF($AK$4=$DB$10,AU8,IF($AK$4=$DB$11,AO8,IF($AK$4=$DB$12,AP8,IF($AK$4=$DB$13,AQ8,IF($AK$4=$DB$14,AR8,\"\")))))))","v":0},{"$f":"IF(AI8=$DC$8,AL8,IF(AI8=$DC$9,AM9+AL8,IF(AI8=$DC$10,IF(AI9=$DC$10,AM9+AL8,AL8),)))","v":0},25,{"$f":"COUNTIF($C$10:$AG$18,$AJ8)","v":0},{"$f":"COUNTIF($C$22:$AG$30,$AJ8)","v":0},{"$f":"COUNTIF($C$34:$AG$42,$AJ8)","v":0},{"$f":"COUNTIF($C$46:$AG$54,$AJ8)","v":0},{"$f":"SUM(AO8:AR8)","v":0},{"$f":"'Jan-Abr 2025'!AT8","v":0},{"$f":"'Jan-Abr 2025'!AS8+'Mai-Ago 2025'!AS8","v":0},{"$nulls":3},{"$f":"IF(AW8=$DC$8,BA8,IF(AW8=$DC$9,BA8,IF(AW8=$DC$10,AZ8,)))","v":0},{"$f":"IF($AK$4=$DB$8,BG8,IF($AK$4=$DB$9,BH8,IF($AK$4=$DB$10,BI8,IF($AK$4=$DB$11,BC8,IF($AK$4=$DB$12,BD8,IF($AK$4=$DB$13,BE8,IF($AK$4=$DB$14,BF8,\"\")))))))","v":0},{"$f":"IF(AW8=$DC$8,AZ8,IF(AW8=$DC$9,BA9+AZ8,IF(AW8=$DC$10,IF(AW9=$DC$10,BA9+AZ8,AZ8),)))","v":0},null,{"$f":"COUNTIF($C$10:$AG$18,$AX8)","v":0},{"$f":"COUNTIF($C$22:$AG$30,$AX8)","v":0},{"$f":"COUNTIF($C$34:$AG$42,$AX8)","v":0},{"$f":"COUNTIF($C$46:$AG$54,$AX8)","v":0},{"$f":"SUM(BC8:BF8)","v":0},{"$f":"'Jan-Abr 2025'!BH8","v":0},{"$f":"'Jan-Abr 2025'!BG8+'Mai-Ago 2025'!BG8","v":0},{"$nulls":3},{"$f":"IF(BK8=$DC$8,BO8,IF(BK8=$DC$9,BO8,IF(BK8=$DC$10,BN8,)))","v":0},{"$f":"IF($AK$4=$DB$8,BU8,IF($AK$4=$DB$9,BV8,IF($AK$4=$DB$10,BW8,IF($AK$4=$DB$11,BQ8,IF($AK$4=$DB$12,BR8,IF($AK$4=$DB$13,BS8,IF($AK$4=$DB$14,BT8,\"\")))))))","v":0},{"$f":"IF(BK8=$DC$8,BN8,IF(BK8=$DC$9,BO9+BN8,IF(BK8=$DC$10,IF(BK9=$DC$10,BO9+BN8,BN8),)))","v":0},null,{"$f":"COUNTIF($C$10:$AG$18,$BL8)","v":0},{"$f":"COUNTIF($C$22:$AG$30,$BL8)","v":0},{"$f":"COUNTIF($C$34:$AG$42,$BL8)","v":0},{"$f":"COUNTIF($C$46:$AG$54,$BL8)","v":0},{"$f":"SUM(BQ8:BT8)","v":0},{"$f":"'Jan-Abr 2025'!BV8","v":0},{"$f":"'Jan-Abr 2025'!BU8+'Mai-Ago 2025'!BU8","v":0},{"$nulls":30},"SF","M"]
[null,null,{"$f":"A8","v":"2025-05-01"},{"$f":"IF(C9=\"\",\"\",IF(DAY(C9)<DAY(EOMONTH(C9,0)),C9+1,\"\"))","v":"2025-05-02"},{"$f":"IF(D9=\"\",\"\",IF(DAY(D9)<DAY(EOMONTH(D9,0)),D9+1,\"\"))","v":"2025-05-03"},"2025-05-04","2025-05-05","2025-05-06","2025-05-07","2025-05-08",{"$f":"IF(J9=\"\",\"\",IF(DAY(J9)<DAY(EOMONTH(J9,0)),J9+1,\"\"))","v":"2025-05-09"},{"$f":"IF(K9=\"\",\"\",IF(DAY(K9)<DAY(EOMONTH(K9,0)),K9+1,\"\"))","v":"2025-05-10"},"2025-05-11","2025-05-12","2025-05-13","2025-05-14","2025-05-15",{"$f":"IF(Q9=\"\",\"\",IF(DAY(Q9)<DAY(EOMONTH(Q9,0)),Q9+1,\"\"))","v":"2025-05-16"},{"$f":"IF(R9=\"\",\"\",IF(DAY(R9)<DAY(EOMONTH(R9,0)),R9+1,\"\"))","v":"2025-05-17"},"2025-05-18","2025-05-19","2025-05-20","2025-05-21","2025-05-22",{"$f":"IF(X9=\"\",\"\",IF(DAY(X9)<DAY(EOMONTH(X9,0)),X9+1,\"\"))","v":"2025-05-23"},{"$f":"IF(Y9=\"\",\"\",IF(DAY(Y9)<DAY(EOMONTH(Y9,0)),Y9+1,\"\"))","v":"2025-05-24"},"2025-05-25","2025-05-26","2025-05-27","2025-05-28","2025-05-29",{"$f":"IF(AE9=\"\",\"\",IF(DAY(AE9)<DAY(EOMONTH(AE9,0)),AE9+1,\"\"))","v":"2025-05-30"},{"$f":"IF(AF9=\"\",\"\",IF(DAY(AF9)<DAY(EOMONTH(AF9,0)),AF9+1,\"\"))","v":"2025-05-31"},null,null,"GMQ",0,{"$f":"IF($AK$4=$DB$8,AS9,IF($AK$4=$DB$9,AT9,IF($AK$4=$DB$10,AU9,IF($AK$4=$DB$11,AO9,IF($AK$4=$DB$12,AP9,IF($AK$4=$DB$13,AQ9,IF($AK$4=$DB$14,AR9,\"\")))))))","v":0},0,25,{"$f":"COUNTIF($C$10:$AG$18,$AJ9)","v":0},{"$f":"COUNTIF($C$22:$AG$30,$AJ9)","v":0},{"$f":"COUNTIF($C$34:$AG$42,$AJ9)","v":0},{"$f":"COUNTIF($C$46:$AG$54,$AJ9)","v":0},0,{"$f":"'Jan-Abr 2025'!AT9","v":0},{"$f":"'Jan-Abr 2025'!AS9+'Mai-Ago 2025'!AS9","v":0},{"$nulls":3},0,{"$f":"IF($AK$4=$DB$8,BG9,IF($AK$4=$DB$9,BH9,IF($AK$4=$DB$10,BI9,IF($AK$4=$DB$11,BC9,IF($AK$4=$DB$12,BD9,IF($AK$4=$DB$13,BE9,IF($AK$4=$DB$14,BF9,\"\")))))))","v":0},0,null,{"$f":"COUNTIF($C$10:$AG$18,$AX9)","v":0},{"$f":"COUNTIF($C$22:$AG$30,$AX9)","v":0},{"$f":"COUNTIF($C$34:$AG$42,$AX9)","v":0},{"$f":"COUNTIF($C$46:$AG$54,$AX9)","v":0},{"$f":"SUM(BC9:BF9)","v":0},{"$f":"'Jan-Abr 2025'!BH9","v":0},{"$f":"'Jan-Abr 2025'!BG9+'Mai-Ago 2025'!BG9","v":0},{"$nulls":3},0,{"$f":"IF($AK$4=$DB$8,BU9,IF($AK$4=$DB$9,BV9,IF($AK$4=$DB$10,BW9,IF($AK$4=$DB$11,BQ9,IF($AK$4=$DB$12,BR9,IF($AK$4=$DB$13,BS9,IF($AK$4=$DB$14,BT9,\"\")))))))","v":0},0,null,{"$f":"COUNTIF($C$10:$AG$18,$BL9)","v":0},{"$f":"COUNTIF($C$22:$AG$30,$BL9)","v":0},{"$f":"COUNTIF($C$34:$AG$42,$BL9)","v":0},{"$f":"COUNTIF($C$46:$AG$54,$BL9)","v":0},{"$f":"SUM(BQ9:BT9)","v":0},{"$f":"'Jan-Abr 2025'!BV9","v":0},{"$f":"'Jan-Abr 2025'!BU9+'Mai-Ago 2025'!BU9","v":0},{"$nulls":30},"ST","T"]
["09h00 - 09h50",{"$nulls":34},"SGQ",0,0,0,25,0,0,0,0,0,{"$f":"'Jan-Abr 2025'!AT10","v":0},{"$f":"'Jan-Abr 2025'!AS10+'Mai-Ago 2025'!AS10","v":0},{"$nulls":3},0,0,0,null,0,0,0,0,0,{"$f":"'Jan-Abr 2025'!BH10","v":0},{"$f":"'Jan-Abr 2025'!BG10+'Mai-Ago 2025'!BG10","v":0},{"$nulls":3},0,0,0,null,0,0,0,0,0,{"$f":"'Jan-Abr 2025'!BV10","v":0},{"$f":"'Jan-Abr 2025'!BU10+'Mai-Ago 2025'!BU10","v":0},{"$nulls":30},"SA","P"]
["09h50 - 10h40",null,"Trab.",{"$nulls":32},"ASHST",0,0,0,25,0,0,0,0,0,{"$f":"'Jan-Abr 2025'!AT11","v":0},{"$f":"'Jan-Abr 2025'!AS11+'Mai-Ago 2025'!AS11","v":0},{"$nulls":3},0,0,0,null,0,0,0,0,0,{"$f":"'Jan-Abr 2025'!BH11","v":0},{"$f":"'Jan-Abr 2025'!BG11+'Mai-Ago 2025'!BG11","v":0},{"$nulls":3},0,0,0,null,0,0,0,0,0,{"$f":"'Jan-Abr 2025'!BV11","v":0},{"$f":"'Jan-Abr 2025'!BU11+'Mai-Ago 2025'!BU11","v":0},{"$nulls":30},{"$f":"TEXT(A8,\"mmm\")","v":"mai"}]
["11h00 - 11h50",{"$nulls":34},"DT",0,0,0,25,0,0,0,0,0,{"$f":"'Jan-Abr 2025'!AT12","v":0},{"$f":"'Jan-Abr 2025'!AS12+'Mai-Ago 2025'!AS12","v":0},{"$nulls":3},0,0,0,null,0,0,0,0,0,{"$f":"'Jan-Abr 2025'!BH12","v":0},{"$f":"'Jan-Abr 2025'!BG12+'Mai-Ago 2025'!BG12","v":0},{"$nulls":3},0,0,0,null,0,0,0,0,0,{"$f":"'Jan-Abr 2025'!BV12","v":0},{"$f":"'Jan-Abr 2025'!BU12+'Mai-Ago 2025'!BU12","v":0},{"$nulls":30},{"$f":"TEXT(A20,\"mmm\")","v":"jun"}]
["11h50 - 12h40",{"$nulls":34},"ICS",0,0,0,25,0,0,0,0,0,{"$f":"'Jan-Abr 2025'!AT13","v":0},{"$f":"'Jan-Abr 2025'!AS13+'Mai-Ago 2025'!AS13","v":0},{"$nulls":3},0,0,0,null,0,0,0,0,0,{"$f":"'Jan-Abr 2025'!BH13","v":0},{"$f":"'Jan-Abr 2025'!BG13+'Mai-Ago 2025'!BG13","v":0},{"$nulls":3},0,0,0,null,0,0,0,0,0,{"$f":"'Jan-Abr 2025'!BV13","v":0},{"$f":"'Jan-Abr 2025'!BU13+'Mai-Ago 2025'!BU13","v":0},{"$nulls":30},{"$f":"TEXT(A32,\"mmm\")","v":"jul"}]
[{"$nulls":36},0,0,0,null,0,0,0,0,0,{"$f":"'Jan-Abr 2025'!AT14","v":0},{"$f":"'Jan-Abr 2025'!AS14+'Mai-Ago 2025'!AS14","v":0},{"$nulls":3},0,0,0,null,0,0,0,0,0,{"$f":"'Jan-Abr 2025'!BH14","v":0},{"$f":"'Jan-Abr 2025'!BG14+'Mai-Ago 2025'!BG14","v":0},{"$nulls":3},0,0,0,null,0,0,0,0,0,{"$f":"'Jan-Abr 2025'!BV14","v":0},{"$f":"'Jan-Abr 2025'!BU14+'Mai-Ago 2025'!BU14","v":0},{"$nulls":30},{"$f":"TEXT(A44,\"mmm\")","v":"ago"}]
["14h00 - 14h50",{"$nulls":34},"PFL",0,0,0,25,0,0,0,0,0,{"$f":"'Jan-Abr 2025'!AT15","v":0},{"$f":"'Jan-Abr 2025'!AS15+'Mai-Ago 2025'!AS15","v":0},{"$nulls":3},0,0,0,null,0,0,0,0,0,{"$f":"'Jan-Abr 2025'!BH15","v":0},{"$f":"'Jan-Abr 2025'!BG15+'Mai-Ago 2025'!BG15","v":0},{"$nulls":3},0,0,0,null,0,0,0,0,0,{"$f":"'Jan-Abr 2025'!BV15","v":0},{"$f":"'Jan-Abr 2025'!BU15+'Mai-Ago 2025'!BU15","v":0}]
["14h50 - 15h40",{"$nulls":34},"PCC",0,0,0,25,0,0,0,0,0,{"$f":"'Jan-Abr 2025'!AT16","v":0},{"$f":"'Jan-Abr 2025'!AS16+'Mai-Ago 2025'!AS16","v":0},{"$nulls":3},0,0,0,null,0,0,0,0,0,{"$f":"'Jan-Abr 2025'!BH16","v":0},{"$f":"'Jan-Abr 2025'!BG16+'Mai-Ago 2025'!BG16","v":0},{"$nulls":3},0,0,0,null,0,0,0,0,0,{"$f":"'Jan-Abr 2025'!BV16","v":0},{"$f":"'Jan-Abr 2025'!BU16+'Mai-Ago 2025'!BU16","v":0}]
["16h00 - 16h50",{"$nulls":34},"PAA",0,0,0,25,0,0,0,0,0,{"$f":"'Jan-Abr 2025'!AT17","v":0},{"$f":"'Jan-Abr 2025'!AS17+'Mai-Ago 2025'!AS17","v":0},{"$nulls":3},0,0,0,null,0,0,0,0,0,{"$f":"'Jan-Abr 2025'!BH17","v":0},{"$f":"'Jan-Abr 2025'!BG17+'Mai-Ago 2025'!BG17","v":0},{"$nulls":3},0,0,0,null,0,0,0,0,0,{"$f":"'Jan-Abr 2025'!BV17","v":0},{"$f":"'Jan-Abr 2025'!BU17+'Mai-Ago 2025'!BU17","v":0}]
["16h50 - 17h40",{"$nulls":34},"IME",0,0,0,50,0,0,0,0,0,{"$f":"'Jan-Abr 2025'!AT18","v":0},{"$f":"'Jan-Abr 2025'!AS18+'Mai-Ago 2025'!AS18","v":0},{"$nulls":3},0,0,0,null,0,0,0,0,0,{"$f":"'Jan-Abr 2025'!BH18","v":0},{"$f":"'Jan-Abr 2025'!BG18+'Mai-Ago 2025'!BG18","v":0},{"$nulls":3},0,0,0,null,0,0,0,0,0,{"$f":"'Jan-Abr 2025'!BV18","v":0},{"$f":"'Jan-Abr 2025'!BU18+'Mai-Ago 2025'!BU18","v":0}]
[{"$nulls":35},"ELE",0,0,0,50,0,0,0,0,0,{"$f":"'Jan-Abr 2025'!AT19","v":0},{"$f":"'Jan-Abr 2025'!AS19+'Mai-Ago 2025'!AS19","v":0},{"$nulls":3},0,0,0,null,0,0,0,0,0,{"$f":"'Jan-Abr 2025'!BH19","v":0},{"$f":"'Jan-Abr 2025'!BG19+'Mai-Ago 2025'!BG19","v":0},{"$nulls":3},0,0,0,null,0,0,0,0,0,{"$f":"'Jan-Abr 2025'!BV19","v":0},{"$f":"'Jan-Abr 2025'!BU19+'Mai-Ago 2025'!BU19","v":0}]
[{"$f":"A8+DAY(EOMONTH(A8,0))","v":"2025-06-01"},null,{"$f":"IF(C21<>\"\",CHOOSE(WEEKDAY(C21,1),\"Dom.\",\"Seg.\",\"Ter.\",\"Qua.\",\"Qui.\",\"Sex.\",\"Sáb.\"),\"\")","v":"Dom."},{"$f":"IF(D21<>\"\",CHOOSE(WEEKDAY(D21,1),\"Dom.\",\"Seg.\",\"Ter.\",\"Qua.\",\"Qui.\",\"Sex.\",\"Sáb.\"),\"\")","v":"Seg."},"Ter.","Qua.","Qui.","Sex.","Sáb.","Dom.","Seg.","Ter.","Qua.","Qui.","Sex.","Sáb.","Dom.","Seg.","Ter.","Qua.","Qui.","Sex.","Sáb.","Dom.","Seg.","Ter.","Qua.","Qui.","Sex.","Sáb.","Dom.","Seg.","",null,null,"CP",0,0,0,25,0,0,0,0,0,{"$f":"'Jan-Abr 2025'!AT20","v":0},{"$f":"'Jan-Abr 2025'!AS20+'Mai-Ago 2025'!AS20","v":0},{"$nulls":3},0,0,0,null,0,0,0,0,0,{"$f":"'Jan-Abr 2025'!BH20","v":0},{"$f":"'Jan-Abr 2025'!BG20+'Mai-Ago 2025'!BG20","v":0},{"$nulls":3},0,0,0,null,0,0,0,0,0,{"$f":"'Jan-Abr 2025'!BV20","v":0},{"$f":"'Jan-Abr 2025'!BU20+'Mai-Ago 2025'!BU20","v":0}]
[null,null,{"$f":"A20","v":"2025-06-01"},{"$f":"IF(C21=\"\",\"\",IF(DAY(C21)<DAY(EOMONTH(C21,0)),C21+1,\"\"))","v":"2025-06-02"},"2025-06-03","2025-06-04","2025-06-05","2025-06-06","2025-06-07","2025-06-08","2025-06-09","2025-06-10","2025-06-11","2025-06-12","2025-06-13","2025-06-14","2025-06-15","2025-06-16","2025-06-17","2025-06-18","2025-06-19","2025-06-20","2025-06-21","2025-06-22","2025-06-23","2025-06-24","2025-06-25","2025-06-26","2025-06-27","2025-06-28","2025-06-29","2025-06-30","",null,null,"CH",0,0,0,25,0,0,0,0,0,{"$f":"'Jan-Abr 2025'!AT21","v":0},{"$f":"'Jan-Abr 2025'!AS21+'Mai-Ago 2025'!AS21","v":0},{"$nulls":3},0,0,0,null,0,0,0,0,0,{"$f":"'Jan-Abr 2025'!BH21","v":0},{"$f":"'Jan-Abr 2025'!BG21+'Mai-Ago 2025'!BG21","v":0},{"$nulls":3},0,0,0,null,0,0,0,0,0,{"$f":"'Jan-Abr 2025'!BV21","v":0},{"$f":"'Jan-Abr 2025'!BU21+'Mai-Ago 2025'!BU21","v":0}]
[{"$f":"A10","v":"09h00 - 09h50"},{"$nulls":10},"Dia",{"$nulls":8},"Corpo",{"$nulls":14},"CLP",0,0,0,50,0,0,0,0,0,{"$f":"'Jan-Abr 2025'!AT22","v":0},{"$f":"'Jan-Abr 2025'!AS22+'Mai-Ago 2025'!AS22","v":0},{"$nulls":3},0,0,0,null,0,0,0,0,0,{"$f":"'Jan-Abr 2025'!BH22","v":0},{"$f":"'Jan-Abr 2025'!BG22+'Mai-Ago 2025'!BG22","v":0},{"$nulls":3},0,0,0,null,0,0,0,0,0,{"$f":"'Jan-Abr 2025'!BV22","v":0},{"$f":"'Jan-Abr 2025'!BU22+'Mai-Ago 2025'!BU22","v":0}]
[{"$f":"A11","v":"09h50 - 10h40"},{"$nulls":10},"de",{"$nulls":8},"de",{"$nulls":14},"DCM",0,0,0,50,0,0,0,0,0,{"$f":"'Jan-Abr 2025'!AT23","v":0},{"$f":"'Jan-Abr 2025'!AS23+'Mai-Ago 2025'!AS23","v":0},{"$nulls":3},0,0,0,null,0,0,0,0,0,{"$f":"'Jan-Abr 2025'!BH23","v":0},{"$f":"'Jan-Abr 2025'!BG23+'Mai-Ago 2025'!BG23","v":0},{"$nulls":3},0,0,0,null,0,0,0,0,0,{"$f":"'Jan-Abr 2025'!BV23","v":0},{"$f":"'Jan-Abr 2025'!BU23+'Mai-Ago 2025'!BU23","v":0}]
["11h00 - 11h50",{"$nulls":10},"Port.",{"$nulls":8},"Deus",{"$nulls":14},"CM",0,0,0,50,0,0,0,0,0,{"$f":"'Jan-Abr 2025'!AT24","v":0},{"$f":"'Jan-Abr 2025'!AS24+'Mai-Ago 2025'!AS24","v":0},{"$nulls":3},0,0,0,null,0,0,0,0,0,{"$f":"'Jan-Abr 2025'!BH24","v":0},{"$f":"'Jan-Abr 2025'!BG24+'Mai-Ago 2025'!BG24","v":0},{"$nulls":3},0,0,0,null,0,0,0,0,0,{"$f":"'Jan-Abr 2025'!BV24","v":0},{"$f":"'Jan-Abr 2025'!BU24+'Mai-Ago 2025'!BU24","v":0}]
["11h50 - 12h40",{"$nulls":34},"SD",0,0,0,50,0,0,0,0,0,{"$f":"'Jan-Abr 2025'!AT25","v":0},{"$f":"'Jan-Abr 2025'!AS25+'Mai-Ago 2025'!AS25","v":0},{"$nulls":3},0,0,0,null,0,0,0,0,0,{"$f":"'Jan-Abr 2025'!BH25","v":0},{"$f":"'Jan-Abr 2025'!BG25+'Mai-Ago 2025'!BG25","v":0},{"$nulls":3},0,0,0,null,0,0,0,0,0,{"$f":"'Jan-Abr 2025'!BV25","v":0},{"$f":"'Jan-Abr 2025'!BU25+'Mai-Ago 2025'!BU25","v":0}]
[{"$nulls":35},"OEM",0,0,0,50,0,0,0,0,0,{"$f":"'Jan-Abr 2025'!AT26","v":0},{"$f":"'Jan-Abr 2025'!AS26+'Mai-Ago 2025'!AS26","v":0},{"$nulls":3},0,0,0,null,0,0,0,0,0,{"$f":"'Jan-Abr 2025'!BH26","v":0},{"$f":"'Jan-Abr 2025'!BG26+'Mai-Ago 2025'!BG26","v":0},{"$nulls":3},0,0,0,null,0,0,0,0,0,{"$f":"'Jan-Abr 2025'!BV26","v":0},{"$f":"'Jan-Abr 2025'!BU26+'Mai-Ago 2025'!BU26","v":0}]
["14h00 - 14h50",{"$nulls":34},"GP",0,0,0,50,0,0,0,0,0,{"$f":"'Jan-Abr 2025'!AT27","v":0},{"$f":"'Jan-Abr 2025'!AS27+'Mai-Ago 2025'!AS27","v":0},{"$nulls":3},0,0,0,null,0,0,0,0,0,{"$f":"'Jan-Abr 2025'!BH27","v":0},{"$f":"'Jan-Abr 2025'!BG27+'Mai-Ago 2025'!BG27","v":0},{"$nulls":3},0,0,0,null,0,0,0,0,0,{"$f":"'Jan-Abr 2025'!BV27","v":0},{"$f":"'Jan-Abr 2025'!BU27+'Mai-Ago 2025'!BU27","v":0}]
["14h50 - 15h40",{"$nulls":34},"PP",0,0,0,50,0,0,0,0,0,{"$f":"'Jan-Abr 2025'!AT28","v":0},{"$f":"'Jan-Abr 2025'!AS28+'Mai-Ago 2025'!AS28","v":0},{"$nulls":3},0,0,0,null,0,0,0,0,0,{"$f":"'Jan-Abr 2025'!BH28","v":0},{"$f":"'Jan-Abr 2025'!BG28+'Mai-Ago 2025'!BG28","v":0},{"$nulls":3},0,0,0,null,0,0,0,0,0,{"$f":"'Jan-Abr 2025'!BV28","v":0},{"$f":"'Jan-Abr 2025'!BU28+'Mai-Ago 2025'!BU28","v":0}]
["16h00 - 16h50",{"$nulls":34},"GS",0,0,0,50,0,0,0,0,0,{"$f":"'Jan-Abr 2025'!AT29","v":0},{"$f":"'Jan-Abr 2025'!AS29+'Mai-Ago 2025'!AS29","v":0},{"$nulls":3},0,0,0,null,0,0,0,0,0,{"$f":"'Jan-Abr 2025'!BH29","v":0},{"$f":"'Jan-Abr 2025'!BG29+'Mai-Ago 2025'!BG29","v":0},{"$nulls":3},0,0,0,null,0,0,0,0,0,{"$f":"'Jan-Abr 2025'!BV29","v":0},{"$f":"'Jan-Abr 2025'!BU29+'Mai-Ago 2025'!BU29","v":0}]
["16h50 - 17h40",{"$nulls":34},"CGO",0,0,0,50,0,0,0,0,0,{"$f":"'Jan-Abr 2025'!AT30","v":0},{"$f":"'Jan-Abr 2025'!AS30+'Mai-Ago 2025'!AS30","v":0},{"$nulls":3},0,0,0,null,0,0,0,0,0,{"$f":"'Jan-Abr 2025'!BH30","v":0},{"$f":"'Jan-Abr 2025'!BG30+'Mai-Ago 2025'!BG30","v":0},{"$nulls":3},0,0,0,null,0,0,0,0,0,{"$f":"'Jan-Abr 2025'!BV30","v":0},{"$f":"'Jan-Abr 2025'!BU30+'Mai-Ago 2025'!BU30","v":0}]
[{"$nulls":35},"LOG",0,0,0,50,0,0,0,0,0,{"$f":"'Jan-Abr 2025'!AT31","v":0},{"$f":"'Jan-Abr 2025'!AS31+'Mai-Ago 2025'!AS31","v":0},{"$nulls":3},0,0,0,null,0,0,0,0,0,{"$f":"'Jan-Abr 2025'!BH31","v":0},{"$f":"'Jan-Abr 2025'!BG31+'Mai-Ago 2025'!BG31","v":0},{"$nulls":3},0,0,0,null,0,0,0,0,0,{"$f":"'Jan-Abr 2025'!BV31","v":0},{"$f":"'Jan-Abr 2025'!BU31+'Mai-Ago 2025'!BU31","v":0}]
[{"$f":"A20+DAY(EOMONTH(A20,0))","v":"2025-07-01"},null,{"$f":"IF(C33<>\"\",CHOOSE(WEEKDAY(C33,1),\"Dom.\",\"Seg.\",\"Ter.\",\"Qua.\",\"Qui.\",\"Sex.\",\"Sáb.\"),\"\")","v":"Ter."},{"$f":"IF(D33<>\"\",CHOOSE(WEEKDAY(D33,1),\"Dom.\",\"Seg.\",\"Ter.\",\"Qua.\",\"Qui.\",\"Sex.\",\"Sáb.\"),\"\")","v":"Qua."},"Qui.","Sex.","Sáb.","Dom.","Seg.","Ter.","Qua.","Qui.","Sex.","Sáb.","Dom.","Seg.","Ter.","Qua.","Qui.","Sex.","Sáb.","Dom.","Seg.","Ter.","Qua.","Qui.","Sex.","Sáb.","Dom.","Seg.","Ter.","Qua.","Qui.",null,null,"MOT",0,0,0,50,0,0,0,0,0,{"$f":"'Jan-Abr 2025'!AT32","v":0},{"$f":"'Jan-Abr 2025'!AS32+'Mai-Ago 2025'!AS32","v":0},{"$nulls":3},0,0,0,null,0,0,0,0,0,{"$f":"'Jan-Abr 2025'!BH32","v":0},{"$f":"'Jan-Abr 2025'!BG32+'Mai-Ago 2025'!BG32","v":0},{"$nulls":3},0,0,0,null,0,0,0,0,0,{"$f":"'Jan-Abr 2025'!BV32","v":0},{"$f":"'Jan-Abr 2025'!BU32+'Mai-Ago 2025'!BU32","v":0}]
[null,null,{"$f":"A32","v":"2025-07-01"},{"$f":"IF(C33=\"\",\"\",IF(DAY(C33)<DAY(EOMONTH(C33,0)),C33+1,\"\"))","v":"2025-07-02"},"2025-07-03","2025-07-04","2025-07-05","2025-07-06","2025-07-07","2025-07-08","2025-07-09","2025-07-10","2025-07-11","2025-07-12","2025-07-13","2025-07-14","2025-07-15","2025-07-16","2025-07-17","2025-07-18","2025-07-19","2025-07-20","2025-07-21","2025-07-22","2025-07-23","2025-07-24","2025-07-25","2025-07-26","2025-07-27","2025-07-28","2025-07-29","2025-07-30","2025-07-31",null,null,"SGI",0,0,0,25,0,0,0,0,0,{"$f":"'Jan-Abr 2025'!AT33","v":0},{"$f":"'Jan-Abr 2025'!AS33+'Mai-Ago 2025'!AS33","v":0},{"$nulls":3},0,0,0,null,0,0,0,0,0,{"$f":"'Jan-Abr 2025'!BH33","v":0},{"$f":"'Jan-Abr 2025'!BG33+'Mai-Ago 2025'!BG33","v":0},{"$nulls":3},0,0,0,null,0,0,0,0,0,{"$f":"'Jan-Abr 2025'!BV33","v":0},{"$f":"'Jan-Abr 2025'!BU33+'Mai-Ago 2025'!BU33","v":0}]
[{"$f":"A22","v":"09h00 - 09h50"},{"$nulls":34},"QCEP",0,0,0,50,0,0,0,0,0,{"$f":"'Jan-Abr 2025'!AT34","v":0},{"$f":"'Jan-Abr 2025'!AS34+'Mai-Ago 2025'!AS34","v":0},{"$nulls":3},0,0,0,null,0,0,0,0,0,{"$f":"'Jan-Abr 2025'!BH34","v":0},{"$f":"'Jan-Abr 2025'!BG34+'Mai-Ago 2025'!BG34","v":0},{"$nulls":3},0,0,0,null,0,0,0,0,0,{"$f":"'Jan-Abr 2025'!BV34","v":0},{"$f":"'Jan-Abr 2025'!BU34+'Mai-Ago 2025'!BU34","v":0}]
[{"$f":"A23","v":"09h50 - 10h40"},{"$nulls":35},0,0,0,null,0,0,0,0,0,{"$f":"'Jan-Abr 2025'!AT35","v":0},{"$f":"'Jan-Abr 2025'!AS35+'Mai-Ago 2025'!AS35","v":0},{"$nulls":3},0,0,0,null,0,0,0,0,0,{"$f":"'Jan-Abr 2025'!BH35","v":0},{"$f":"'Jan-Abr 2025'!BG35+'Mai-Ago 2025'!BG35","v":0},{"$nulls":3},0,0,0,null,0,0,0,0,0,{"$f":"'Jan-Abr 2025'!BV35","v":0},{"$f":"'Jan-Abr 2025'!BU35+'Mai-Ago 2025'!BU35","v":0}]
["11h00 - 11h50",{"$nulls":35},0,0,0,null,0,0,0,0,0,{"$f":"'Jan-Abr 2025'!AT36","v":0},{"$f":"'Jan-Abr 2025'!AS36+'Mai-Ago 2025'!AS36","v":0},{"$nulls":3},0,0,0,null,0,0,0,0,0,{"$f":"'Jan-Abr 2025'!BH36","v":0},{"$f":"'Jan-Abr 2025'!BG36+'Mai-Ago 2025'!BG36","v":0},{"$nulls":3},0,0,0,null,0,0,0,0,0,{"$f":"'Jan-Abr 2025'!BV36","v":0},{"$f":"'Jan-Abr 2025'!BU36+'Mai-Ago 2025'!BU36","v":0}]
["11h50 - 12h40",{"$nulls":35},0,0,0,null,0,0,0,0,0,{"$f":"'Jan-Abr 2025'!AT37","v":0},{"$f":"'Jan-Abr 2025'!AS37+'Mai-Ago 2025'!AS37","v":0},{"$nulls":3},0,0,0,null,0,0,0,0,0,{"$f":"'Jan-Abr 2025'!BH37","v":0},{"$f":"'Jan-Abr 2025'!BG37+'Mai-Ago 2025'!BG37","v":0},{"$nulls":3},0,0,0,null,0,0,0,0,0,{"$f":"'Jan-Abr 2025'!BV37","v":0},{"$f":"'Jan-Abr 2025'!BU37+'Mai-Ago 2025'!BU37","v":0}]
[{"$nulls":36},0,0,0,null,0,0,0,0,0,{"$f":"'Jan-Abr 2025'!AT38","v":0},{"$f":"'Jan-Abr 2025'!AS38+'Mai-Ago 2025'!AS38","v":0},{"$nulls":3},0,0,0,null,0,0,0,0,0,{"$f":"'Jan-Abr 2025'!BH38","v":0},{"$f":"'Jan-Abr 2025'!BG38+'Mai-Ago 2025'!BG38","v":0},{"$nulls":3},0,0,0,null,0,0,0,0,0,{"$f":"'Jan-Abr 2025'!BV38","v":0},{"$f":"'Jan-Abr 2025'!BU38+'Mai-Ago 2025'!BU38","v":0}]
["14h00 - 14h50",{"$nulls":35},0,0,0,null,0,0,0,0,0,{"$f":"'Jan-Abr 2025'!AT39","v":0},{"$f":"'Jan-Abr 2025'!AS39+'Mai-Ago 2025'!AS39","v":0},{"$nulls":3},0,0,0,null,0,0,0,0,0,{"$f":"'Jan-Abr 2025'!BH39","v":0},{"$f":"'Jan-Abr 2025'!BG39+'Mai-Ago 2025'!BG39","v":0},{"$nulls":3},0,0,0,null,0,0,0,0,0,{"$f":"'Jan-Abr 2025'!BV39","v":0},{"$f":"'Jan-Abr 2025'!BU39+'Mai-Ago 2025'!BU39","v":0}]
["14h50 - 15h40",{"$nulls":35},0,0,0,null,0,0,0,0,{"$f":"SUM(AO40:AR40)","v":0},{"$f":"'Jan-Abr 2025'!AT40","v":0},{"$f":"'Jan-Abr 2025'!AS40+'Mai-Ago 2025'!AS40","v":0},{"$nulls":3},0,0,0,null,0,0,0,0,0,{"$f":"'Jan-Abr 2025'!BH40","v":0},{"$f":"'Jan-Abr 2025'!BG40+'Mai-Ago 2025'!BG40","v":0},{"$nulls":3},0,0,0,null,0,0,0,0,0,{"$f":"'Jan-Abr 2025'!BV40","v":0},{"$f":"'Jan-Abr 2025'!BU40+'Mai-Ago 2025'!BU40","v":0}]
["16h00 - 16h50",{"$nulls":35},0,0,0,null,0,0,0,0,0,{"$f":"'Jan-Abr 2025'!AT41","v":0},{"$f":"'Jan-Abr 2025'!AS41+'Mai-Ago 2025'!AS41","v":0},{"$nulls":3},0,0,0,null,0,0,0,0,0,{"$f":"'Jan-Abr 2025'!BH41","v":0},{"$f":"'Jan-Abr 2025'!BG41+'Mai-Ago 2025'!BG41","v":0},{"$nulls":3},0,0,0,null,0,0,0,0,0,{"$f":"'Jan-Abr 2025'!BV41","v":0},{"$f":"'Jan-Abr 2025'!BU41+'Mai-Ago 2025'!BU41","v":0}]
["16h50 - 17h40",{"$nulls":35},0,0,0,null,0,0,0,0,0,{"$f":"'Jan-Abr 2025'!AT42","v":0},{"$f":"'Jan-Abr 2025'!AS42+'Mai-Ago 2025'!AS42","v":0},{"$nulls":3},0,0,0,null,0,0,0,0,0,{"$f":"'Jan-Abr 2025'!BH42","v":0},{"$f":"'Jan-Abr 2025'!BG42+'Mai-Ago 2025'!BG42","v":0},{"$nulls":3},0,0,0,null,0,0,0,0,0,{"$f":"'Jan-Abr 2025'!BV42","v":0},{"$f":"'Jan-Abr 2025'!BU42+'Mai-Ago 2025'!BU42","v":0}]
[{"$nulls":36},0,0,0,null,0,0,0,0,0,{"$f":"'Jan-Abr 2025'!AT43","v":0},{"$f":"'Jan-Abr 2025'!AS43+'Mai-Ago 2025'!AS43","v":0},{"$nulls":3},0,0,0,null,0,0,0,0,0,{"$f":"'Jan-Abr 2025'!BH43","v":0},{"$f":"'Jan-Abr 2025'!BG43+'Mai-Ago 2025'!BG43","v":0},{"$nulls":3},0,0,0,null,0,0,0,0,0,{"$f":"'Jan-Abr 2025'!BV43","v":0},{"$f":"'Jan-Abr 2025'!BU43+'Mai-Ago 2025'!BU43","v":0}]
[{"$f":"A32+DAY(EOMONTH(A32,0))","v":"2025-08-01"},null,{"$f":"IF(C45<>\"\",CHOOSE(WEEKDAY(C45,1),\"Dom.\",\"Seg.\",\"Ter.\",\"Qua.\",\"Qui.\",\"Sex.\",\"Sáb.\"),\"\")","v":"Sex."},{"$f":"IF(D45<>\"\",CHOOSE(WEEKDAY(D45,1),\"Dom.\",\"Seg.\",\"Ter.\",\"Qua.\",\"Qui.\",\"Sex.\",\"Sáb.\"),\"\")","v":"Sáb."},"Dom.","Seg.","Ter.","Qua.","Qui.","Sex.","Sáb.","Dom.","Seg.","Ter.","Qua.","Qui.","Sex.","Sáb.","Dom.","Seg.","Ter.","Qua.","Qui.","Sex.","Sáb.","Dom.","Seg.","Ter.","Qua.","Qui.","Sex.","Sáb.","Dom.",{"$nulls":3},0,0,0,null,0,0,0,0,0,{"$f":"'Jan-Abr 2025'!AT44","v":0},{"$f":"'Jan-Abr 2025'!AS44+'Mai-Ago 2025'!AS44","v":0},{"$nulls":3},0,0,0,null,0,0,0,0,0,{"$f":"'Jan-Abr 2025'!BH44","v":0},{"$f":"'Jan-Abr 2025'!BG44+'Mai-Ago 2025'!BG44","v":0},{"$nulls":3},0,0,0,null,0,0,0,0,0,{"$f":"'Jan-Abr 2025'!BV44","v":0},{"$f":"'Jan-Abr 2025'!BU44+'Mai-Ago 2025'!BU44","v":0}]
[null,null,{"$f":"A44","v":"2025-08-01"},{"$f":"IF(C45=\"\",\"\",IF(DAY(C45)<DAY(EOMONTH(C45,0)),C45+1,\"\"))","v":"2025-08-02"},"2025-08-03","2025-08-04","2025-08-05","2025-08-06","2025-08-07","2025-08-08","2025-08-09","2025-08-10","2025-08-11","2025-08-12","2025-08-13","2025-08-14","2025-08-15","2025-08-16","2025-08-17","2025-08-18","2025-08-19","2025-08-20","2025-08-21","2025-08-22","2025-08-23","2025-08-24","2025-08-25","2025-08-26","2025-08-27","2025-08-28","2025-08-29","2025-08-30","2025-08-31",{"$nulls":3},0,0,0,null,0,0,0,0,0,{"$f":"'Jan-Abr 2025'!AT45","v":0},{"$f":"'Jan-Abr 2025'!AS45+'Mai-Ago 2025'!AS45","v":0},{"$nulls":3},0,0,0,null,0,0,0,0,0,{"$f":"'Jan-Abr 2025'!BH45","v":0},{"$f":"'Jan-Abr 2025'!BG45+'Mai-Ago 2025'!BG45","v":0},{"$nulls":3},0,0,0,null,0,0,0,0,0,{"$f":"'Jan-Abr 2025'!BV45","v":0},{"$f":"'Jan-Abr 2025'!BU45+'Mai-Ago 2025'!BU45","v":0}]
[{"$f":"A10","v":"09h00 - 09h50"},{"$nulls":15},"Assunção",{"$nulls":19},0,0,0,null,0,0,0,0,0,{"$f":"'Jan-Abr 2025'!AT46","v":0},{"$f":"'Jan-Abr 2025'!AS46+'Mai-Ago 2025'!AS46","v":0},{"$nulls":3},0,0,0,null,0,0,0,0,0,{"$f":"'Jan-Abr 2025'!BH46","v":0},{"$f":"'Jan-Abr 2025'!BG46+'Mai-Ago 2025'!BG46","v":0},{"$nulls":3},0,0,0,null,0,0,0,0,0,{"$f":"'Jan-Abr 2025'!BV46","v":0},{"$f":"'Jan-Abr 2025'!BU46+'Mai-Ago 2025'!BU46","v":0}]
[{"$f":"A11","v":"09h50 - 10h40"},{"$nulls":15},"Nossa",{"$nulls":19},0,0,0,null,0,0,0,0,0,{"$f":"'Jan-Abr 2025'!AT47","v":0},{"$f":"'Jan-Abr 2025'!AS47+'Mai-Ago 2025'!AS47","v":0},{"$nulls":3},0,0,0,null,0,0,0,0,0,{"$f":"'Jan-Abr 2025'!BH47","v":0},{"$f":"'Jan-Abr 2025'!BG47+'Mai-Ago 2025'!BG47","v":0},{"$nulls":3},0,0,0,null,0,0,0,0,0,{"$f":"'Jan-Abr 2025'!BV47","v":0},{"$f":"'Jan-Abr 2025'!BU47+'Mai-Ago 2025'!BU47","v":0}]
["11h00 - 11h50",{"$nulls":15},"Senhora",{"$nulls":19},0,0,0,null,0,0,0,0,0,{"$f":"'Jan-Abr 2025'!AT48","v":0},{"$f":"'Jan-Abr 2025'!AS48+'Mai-Ago 2025'!AS48","v":0},{"$nulls":3},0,0,0,null,0,0,0,0,0,{"$f":"'Jan-Abr 2025'!BH48","v":0},{"$f":"'Jan-Abr 2025'!BG48+'Mai-Ago 2025'!BG48","v":0},{"$nulls":3},0,0,0,null,0,0,0,0,0,{"$f":"'Jan-Abr 2025'!BV48","v":0},{"$f":"'Jan-Abr 2025'!BU48+'Mai-Ago 2025'!BU48","v":0}]
["11h50 - 12h40",{"$nulls":35},0,0,0,null,0,0,0,0,0,{"$f":"'Jan-Abr 2025'!AT49","v":0},{"$f":"'Jan-Abr 2025'!AS49+'Mai-Ago 2025'!AS49","v":0},{"$nulls":3},0,0,0,null,0,0,0,0,0,{"$f":"'Jan-Abr 2025'!BH49","v":0},{"$f":"'Jan-Abr 2025'!BG49+'Mai-Ago 2025'!BG49","v":0},{"$nulls":3},0,0,0,null,0,0,0,0,0,{"$f":"'Jan-Abr 2025'!BV49","v":0},{"$f":"'Jan-Abr 2025'!BU49+'Mai-Ago 2025'!BU49","v":0}]
[{"$nulls":36},0,0,0,null,0,0,0,0,0,{"$f":"'Jan-Abr 2025'!AT50","v":0},{"$f":"'Jan-Abr 2025'!AS50+'Mai-Ago 2025'!AS50","v":0},{"$nulls":3},0,0,0,null,0,0,0,0,0,{"$f":"'Jan-Abr 2025'!BH50","v":0},{"$f":"'Jan-Abr 2025'!BG50+'Mai-Ago 2025'!BG50","v":0},{"$nulls":3},0,0,0,null,0,0,0,0,0,{"$f":"'Jan-Abr 2025'!BV50","v":0},{"$f":"'Jan-Abr 2025'!BU50+'Mai-Ago 2025'!BU50","v":0}]
["14h00 - 14h50",{"$nulls":35},0,0,0,null,0,0,0,0,0,{"$f":"'Jan-Abr 2025'!AT51","v":0},{"$f":"'Jan-Abr 2025'!AS51+'Mai-Ago 2025'!AS51","v":0},{"$nulls":3},0,0,0,null,0,0,0,0,0,{"$f":"'Jan-Abr 2025'!BH51","v":0},{"$f":"'Jan-Abr 2025'!BG51+'Mai-Ago 2025'!BG51","v":0},{"$nulls":3},0,0,0,null,0,0,0,0,0,{"$f":"'Jan-Abr 2025'!BV51","v":0},{"$f":"'Jan-Abr 2025'!BU51+'Mai-Ago 2025'!BU51","v":0}]
["14h50 - 15h40",{"$nulls":35},0,0,0,null,0,0,0,0,0,{"$f":"'Jan-Abr 2025'!AT52","v":0},{"$f":"'Jan-Abr 2025'!AS52+'Mai-Ago 2025'!AS52","v":0},{"$nulls":3},0,0,0,null,0,0,0,0,0,{"$f":"'Jan-Abr 2025'!BH52","v":0},{"$f":"'Jan-Abr 2025'!BG52+'Mai-Ago 2025'!BG52","v":0},{"$nulls":3},0,0,0,null,0,0,0,0,0,{"$f":"'Jan-Abr 2025'!BV52","v":0},{"$f":"'Jan-Abr 2025'!BU52+'Mai-Ago 2025'!BU52","v":0}]
["16h00 - 16h50",{"$nulls":35},0,0,0,null,0,0,0,0,0,{"$f":"'Jan-Abr 2025'!AT53","v":0},{"$f":"'Jan-Abr 2025'!AS53+'Mai-Ago 2025'!AS53","v":0},{"$nulls":3},0,0,0,null,0,0,0,0,0,{"$f":"'Jan-Abr 2025'!BH53","v":0},{"$f":"'Jan-Abr 2025'!BG53+'Mai-Ago 2025'!BG53","v":0},{"$nulls":3},0,0,0,null,0,0,0,0,0,{"$f":"'Jan-Abr 2025'!BV53","v":0},{"$f":"'Jan-Abr 2025'!BU53+'Mai-Ago 2025'!BU53","v":0}]
["16h50 - 17h40",{"$nulls":35},0,0,0,null,0,0,0,0,0,{"$f":"'Jan-Abr 2025'!AT54","v":0},{"$f":"'Jan-Abr 2025'!AS54+'Mai-Ago 2025'!AS54","v":0},{"$nulls":3},0,0,0,null,0,0,0,0,0,{"$f":"'Jan-Abr 2025'!BH54","v":0},{"$f":"'Jan-Abr 2025'!BG54+'Mai-Ago 2025'!BG54","v":0},{"$nulls":3},0,0,0,null,0,0,0,0,0,{"$f":"'Jan-Abr 2025'!BV54","v":0},{"$f":"'Jan-Abr 2025'!BU54+'Mai-Ago 2025'!BU54","v":0}]
[{"$nulls":32},"Fim",null,null,"PCT",0,0,0,560,0,0,0,0,0,{"$f":"'Jan-Abr 2025'!AT55","v":0},{"$f":"'Jan-Abr 2025'!AS55+'Mai-Ago 2025'!AS55","v":0},{"$nulls":3},0,0,0,null,0,0,0,0,0,{"$f":"'Jan-Abr 2025'!BH55","v":0},{"$f":"'Jan-Abr 2025'!BG55+'Mai-Ago 2025'!BG55","v":0},{"$nulls":3},0,0,0,null,0,0,0,0,0,{"$f":"'Jan-Abr 2025'!BV55","v":0},{"$f":"'Jan-Abr 2025'!BU55+'Mai-Ago 2025'!BU55","v":0}]
["Sociocultural",5146,"IGO","Introdução à Gestão das Organizações",{"$nulls":5},"B153",25,{"$nulls":7},6418,"OEM","Órgãos e Elementos de Máquinas",{"$nulls":5},"C591",50,{"$nulls":8},0,0,0,null,0,0,0,0,0,{"$f":"'Jan-Abr 2025'!AT56","v":0},{"$f":"'Jan-Abr 2025'!AS56+'Mai-Ago 2025'!AS56","v":0},{"$nulls":3},0,0,0,null,0,0,0,0,0,{"$f":"'Jan-Abr 2025'!BH56","v":0},{"$f":"'Jan-Abr 2025'!BG56+'Mai-Ago 2025'!BG56","v":0},{"$nulls":3},0,0,0,null,0,0,0,0,0,{"$f":"'Jan-Abr 2025'!BV56","v":0},{"$f":"'Jan-Abr 2025'!BU56+'Mai-Ago 2025'!BU56","v":0}]
[null,5152,"GMQ","Gestão e Motivação para a Qualidade",{"$nulls":5},"B155",25,{"$nulls":7},"6442","GP","Gestão de Projetos",{"$nulls":6},50,{"$nulls":8},0,0,0,null,0,0,0,0,0,{"$f":"'Jan-Abr 2025'!AT57","v":0},{"$f":"'Jan-Abr 2025'!AS57+'Mai-Ago 2025'!AS57","v":0},{"$nulls":3},0,0,0,null,0,0,0,0,0,{"$f":"'Jan-Abr 2025'!BH57","v":0},{"$f":"'Jan-Abr 2025'!BG57+'Mai-Ago 2025'!BG57","v":0},{"$nulls":3},0,0,0,null,0,0,0,0,0,{"$f":"'Jan-Abr 2025'!BV57","v":0},{"$f":"'Jan-Abr 2025'!BU57+'Mai-Ago 2025'!BU57","v":0}]
[null,5149,"SGQ","Sistama de Gestão da Qualidade ISO 9001",{"$nulls":5},"F369",25,{"$nulls":7},"6443","PP","Planeamento da Produção",{"$nulls":6},50,{"$nulls":8},0,0,0,null,0,0,0,0,0,{"$f":"'Jan-Abr 2025'!AT58","v":0},{"$f":"'Jan-Abr 2025'!AS58+'Mai-Ago 2025'!AS58","v":0},{"$nulls":3},0,0,0,null,0,0,0,0,0,{"$f":"'Jan-Abr 2025'!BH58","v":0},{"$f":"'Jan-Abr 2025'!BG58+'Mai-Ago 2025'!BG58","v":0},{"$nulls":3},0,0,0,null,0,0,0,0,0,{"$f":"'Jan-Abr 2025'!BV58","v":0},{"$f":"'Jan-Abr 2025'!BU58+'Mai-Ago 2025'!BU58","v":0}]
[null,349,"ASHST","Ambiente, Segurança, Higiene e Saúde no Trabalho",{"$nulls":5},"F423",25,{"$nulls":7},"6444","GS","Gestão de Stocks - Metodologias",{"$nulls":6},50,{"$nulls":8},0,0,0,null,0,0,0,0,0,{"$f":"'Jan-Abr 2025'!AT59","v":0},{"$f":"'Jan-Abr 2025'!AS59+'Mai-Ago 2025'!AS59","v":0},{"$nulls":3},0,0,0,null,0,0,0,0,0,{"$f":"'Jan-Abr 2025'!BH59","v":0},{"$f":"'Jan-Abr 2025'!BG59+'Mai-Ago 2025'!BG59","v":0},{"$nulls":3},0,0,0,null,0,0,0,0,0,{"$f":"'Jan-Abr 2025'!BV59","v":0},{"$f":"'Jan-Abr 2025'!BU59+'Mai-Ago 2025'!BU59","v":0}]
[null,5653,"DT","Direito do Trabalho",{"$nulls":5},"B154",25,{"$nulls":7},"1054","CGO","Custeio e Gestão Orçamental",{"$nulls":6},50,{"$nulls":8},0,0,0,null,0,0,0,0,0,{"$f":"'Jan-Abr 2025'!AT60","v":0},{"$f":"'Jan-Abr 2025'!AS60+'Mai-Ago 2025'!AS60","v":0},{"$nulls":3},0,0,0,null,0,0,0,0,0,{"$f":"'Jan-Abr 2025'!BH60","v":0},{"$f":"'Jan-Abr 2025'!BG60+'Mai-Ago 2025'!BG60","v":0},{"$nulls":3},0,0,0,null,0,0,0,0,0,{"$f":"'Jan-Abr 2025'!BV60","v":0},{"$f":"'Jan-Abr 2025'!BU60+'Mai-Ago 2025'!BU60","v":0}]
[null,5768,"ICS","Inglês em Contexto Socioprofissional",{"$nulls":5},"L046",25,{"$nulls":7},"6445","LOG","Logistica ",{"$nulls":6},50,{"$nulls":8},0,0,0,null,0,0,0,0,0,{"$f":"'Jan-Abr 2025'!AT61","v":0},{"$f":"'Jan-Abr 2025'!AS61+'Mai-Ago 2025'!AS61","v":0},{"$nulls":3},0,0,0,null,0,0,0,0,0,{"$f":"'Jan-Abr 2025'!BH61","v":0},{"$f":"'Jan-Abr 2025'!BG61+'Mai-Ago 2025'!BG61","v":0},{"$nulls":3},0,0,0,null,0,0,0,0,0,{"$f":"'Jan-Abr 2025'!BV61","v":0},{"$f":"'Jan-Abr 2025'!BU61+'Mai-Ago 2025'!BU61","v":0}]
[{"$nulls":18},"6446","MOT","Métodos e Organização do Trabalho",{"$nulls":6},50,{"$nulls":8},0,0,0,null,0,0,0,0,0,{"$f":"'Jan-Abr 2025'!AT62","v":0},{"$f":"'Jan-Abr 2025'!AS62+'Mai-Ago 2025'!AS62","v":0},{"$nulls":3},0,0,0,null,0,0,0,0,0,{"$f":"'Jan-Abr 2025'!BH62","v":0},{"$f":"'Jan-Abr 2025'!BG62+'Mai-Ago 2025'!BG62","v":0},{"$nulls":3},0,0,0,null,0,0,0,0,0,{"$f":"'Jan-Abr 2025'!BV62","v":0},{"$f":"'Jan-Abr 2025'!BU62+'Mai-Ago 2025'!BU62","v":0}]
[{"$nulls":18},"6447","SGI","Sistema de Gestão Integrada",{"$nulls":6},25,{"$nulls":8},0,0,0,null,0,0,0,0,0,{"$f":"'Jan-Abr 2025'!AT63","v":0},{"$f":"'Jan-Abr 2025'!AS63+'Mai-Ago 2025'!AS63","v":0},{"$nulls":3},0,0,0,null,{"$f":"COUNTIF($C$10:$AG$18,$AX63)","v":0},{"$f":"COUNTIF($C$22:$AG$30,$AX63)","v":0},{"$f":"COUNTIF($C$34:$AG$42,$AX63)","v":0},{"$f":"COUNTIF($C$46:$AG$54,$AX63)","v":0},0,{"$f":"'Jan-Abr 2025'!BH63","v":0},{"$f":"'Jan-Abr 2025'!BG63+'Mai-Ago 2025'!BG63","v":0},{"$nulls":3},0,0,0,null,0,0,0,0,0,{"$f":"'Jan-Abr 2025'!BV63","v":0},{"$f":"'Jan-Abr 2025'!BU63+'Mai-Ago 2025'!BU63","v":0}]
["Tecnológica",6407,"PFL","Processos de Fundição / Ligação",{"$nulls":5},"D333",25,{"$nulls":7},"6448","QCEP","Qualidade - controlo estatístico de processo",{"$nulls":6},50,{"$nulls":8},0,0,0,null,0,0,0,0,0,{"$f":"'Jan-Abr 2025'!AT64","v":0},{"$f":"'Jan-Abr 2025'!AS64+'Mai-Ago 2025'!AS64","v":0},{"$nulls":3},0,0,0,null,0,0,0,0,0,{"$f":"'Jan-Abr 2025'!BH64","v":0},{"$f":"'Jan-Abr 2025'!BG64+'Mai-Ago 2025'!BG64","v":0},{"$nulls":3},0,0,0,null,0,0,0,0,0,{"$f":"'Jan-Abr 2025'!BV64","v":0},{"$f":"'Jan-Abr 2025'!BU64+'Mai-Ago 2025'!BU64","v":0}]
[null,6408,"PCC","Processos de Conformação / Corte",{"$nulls":5},"D334",25,{"$nulls":25},0,0,0,null,0,0,0,0,0,{"$f":"'Jan-Abr 2025'!AT65","v":0},{"$f":"'Jan-Abr 2025'!AS65+'Mai-Ago 2025'!AS65","v":0},{"$nulls":3},0,0,0,null,0,0,0,0,0,{"$f":"'Jan-Abr 2025'!BH65","v":0},{"$f":"'Jan-Abr 2025'!BG65+'Mai-Ago 2025'!BG65","v":0},{"$nulls":3},0,0,0,null,0,0,0,{"$f":"COUNTIF($C$46:$AG$54,$BL65)","v":0},0,{"$f":"'Jan-Abr 2025'!BV65","v":0},{"$f":"'Jan-Abr 2025'!BU65+'Mai-Ago 2025'!BU65","v":0}]
[null,6409,"PAA","Processos por Arranque de Apara",{"$nulls":5},"C588",25,{"$nulls":25},0,0,0,null,0,0,0,0,0,{"$f":"'Jan-Abr 2025'!AT66","v":0},{"$f":"'Jan-Abr 2025'!AS66+'Mai-Ago 2025'!AS66","v":0},{"$nulls":3},0,0,0,null,0,0,0,0,0,{"$f":"'Jan-Abr 2025'!BH66","v":0},{"$f":"'Jan-Abr 2025'!BG66+'Mai-Ago 2025'!BG66","v":0},{"$nulls":3},0,0,0,null,0,0,0,0,0,{"$f":"'Jan-Abr 2025'!BV66","v":0},{"$f":"'Jan-Abr 2025'!BU66+'Mai-Ago 2025'!BU66","v":0}]
[null,6410,"IME","Instalação de Máquinas Elétricas",{"$nulls":5},"K252",50,{"$nulls":25},0,0,0,null,0,0,0,0,0,{"$f":"'Jan-Abr 2025'!AT67","v":0},{"$f":"'Jan-Abr 2025'!AS67+'Mai-Ago 2025'!AS67","v":0},{"$nulls":3},0,0,0,null,0,0,0,0,0,{"$f":"'Jan-Abr 2025'!BH67","v":0},{"$f":"'Jan-Abr 2025'!BG67+'Mai-Ago 2025'!BG67","v":0},{"$nulls":3},0,0,0,null,0,0,0,0,0,{"$f":"'Jan-Abr 2025'!BV67","v":0},{"$f":"'Jan-Abr 2025'!BU67+'Mai-Ago 2025'!BU67","v":0}]
[null,6411,"ELE","Eletrónica",{"$nulls":5},"K253",50,{"$nulls":25},0,0,0,null,0,0,0,0,0,{"$f":"'Jan-Abr 2025'!AT68","v":0},{"$f":"'Jan-Abr 2025'!AS68+'Mai-Ago 2025'!AS68","v":0},{"$nulls":3},0,0,0,null,0,0,0,0,0,{"$f":"'Jan-Abr 2025'!BH68","v":0},{"$f":"'Jan-Abr 2025'!BG68+'Mai-Ago 2025'!BG68","v":0},{"$nulls":3},0,0,0,null,0,0,0,0,0,{"$f":"'Jan-Abr 2025'!BV68","v":0},{"$f":"'Jan-Abr 2025'!BU68+'Mai-Ago 2025'!BU68","v":0}]
[null,6412,"CP","Circuitos Pneumáticos",{"$nulls":5},"E329",25,{"$nulls":25},0,0,0,null,0,0,0,0,0,{"$f":"'Jan-Abr 2025'!AT69","v":0},{"$f":"'Jan-Abr 2025'!AS69+'Mai-Ago 2025'!AS69","v":0},{"$nulls":3},0,0,0,null,0,0,0,0,0,{"$f":"'Jan-Abr 2025'!BH69","v":0},{"$f":"'Jan-Abr 2025'!BG69+'Mai-Ago 2025'!BG69","v":0},{"$nulls":3},0,0,0,null,0,0,0,0,0,{"$f":"'Jan-Abr 2025'!BV69","v":0},{"$f":"'Jan-Abr 2025'!BU69+'Mai-Ago 2025'!BU69","v":0}]
[null,6413,"CH","Circuitos Óleo-Hidráulicos",{"$nulls":5},"E330",25,{"$nulls":6},"Estágio",null,"PCT","Prática em Contexto Trabalho",{"$nulls":5},"E368",560,{"$nulls":8},0,0,0,null,0,0,0,0,0,{"$f":"'Jan-Abr 2025'!AT70","v":0},{"$f":"'Jan-Abr 2025'!AS70+'Mai-Ago 2025'!AS70","v":0},{"$nulls":3},0,0,0,null,0,0,0,0,0,{"$f":"'Jan-Abr 2025'!BH70","v":0},{"$f":"'Jan-Abr 2025'!BG70+'Mai-Ago 2025'!BG70","v":0},{"$nulls":3},0,0,0,null,0,0,0,0,0,{"$f":"'Jan-Abr 2025'!BV70","v":0},{"$f":"'Jan-Abr 2025'!BU70+'Mai-Ago 2025'!BU70","v":0}]
[null,6414,"CLP","Controladores Lógicos Programáveis",{"$nulls":5},"C589",50,{"$nulls":25},0,0,0,null,0,0,0,0,0,{"$f":"'Jan-Abr 2025'!AT71","v":0},{"$f":"'Jan-Abr 2025'!AS71+'Mai-Ago 2025'!AS71","v":0},{"$nulls":3},0,0,0,null,0,0,0,0,0,{"$f":"'Jan-Abr 2025'!BH71","v":0},{"$f":"'Jan-Abr 2025'!BG71+'Mai-Ago 2025'!BG71","v":0},{"$nulls":3},0,0,0,null,0,0,0,0,0,{"$f":"'Jan-Abr 2025'!BV71","v":0},{"$f":"'Jan-Abr 2025'!BU71+'Mai-Ago 2025'!BU71","v":0}]
[null,6415,"DCM","Desenho de Construções Mecânicas",{"$nulls":5},"A438",50,{"$nulls":25},{"$f":"IF(AI72=$DC$8,AM72,IF(AI72=$DC$9,AM72,IF(AI72=$DC$10,AL72,)))","v":0},0,{"$f":"IF(AI72=$DC$8,AL72,IF(AI72=$DC$9,AM73+AL72,IF(AI72=$DC$10,IF(AI73=$DC$10,AM73+AL72,AL72),)))","v":0},null,0,0,0,0,{"$f":"SUM(AO72:AR72)","v":0},{"$f":"'Jan-Abr 2025'!AT72","v":0},{"$f":"'Jan-Abr 2025'!AS72+'Mai-Ago 2025'!AS72","v":0},{"$nulls":3},{"$f":"IF(AW72=$DC$8,BA72,IF(AW72=$DC$9,BA72,IF(AW72=$DC$10,AZ72,)))","v":0},0,{"$f":"IF(AW72=$DC$8,AZ72,IF(AW72=$DC$9,BA73+AZ72,IF(AW72=$DC$10,IF(AW73=$DC$10,BA73+AZ72,AZ72),)))","v":0},null,0,0,0,0,0,{"$f":"'Jan-Abr 2025'!BH72","v":0},{"$f":"'Jan-Abr 2025'!BG72+'Mai-Ago 2025'!BG72","v":0},{"$nulls":3},{"$f":"IF(BK72=$DC$8,BO72,IF(BK72=$DC$9,BO72,IF(BK72=$DC$10,BN72,)))","v":0},0,{"$f":"IF(BK72=$DC$8,BN72,IF(BK72=$DC$9,BO73+BN72,IF(BK72=$DC$10,IF(BK73=$DC$10,BO73+BN72,BN72),)))","v":0},null,0,0,0,0,0,{"$f":"'Jan-Abr 2025'!BV72","v":0},{"$f":"'Jan-Abr 2025'!BU72+'Mai-Ago 2025'!BU72","v":0}]
[null,6416,"CM","Ciência dos Materiais",{"$nulls":5},"C590",50,{"$nulls":25},0,{"$f":"IF($AK$4=$DB$8,AS73,IF($AK$4=$DB$9,AT73,IF($AK$4=$DB$10,AU73,IF($AK$4=$DB$11,AO73,IF($AK$4=$DB$12,AP73,IF($AK$4=$DB$13,AQ73,IF($AK$4=$DB$14,AR73,\"\")))))))","v":0},0,null,{"$f":"COUNTIF($C$10:$AG$18,$AJ73)","v":0},{"$f":"COUNTIF($C$22:$AG$30,$AJ73)","v":0},{"$f":"COUNTIF($C$34:$AG$42,$AJ73)","v":0},{"$f":"COUNTIF($C$46:$AG$54,$AJ73)","v":0},0,{"$f":"'Jan-Abr 2025'!AT73","v":0},{"$f":"'Jan-Abr 2025'!AS73+'Mai-Ago 2025'!AS73","v":0},{"$nulls":3},0,{"$f":"IF($AK$4=$DB$8,BG73,IF($AK$4=$DB$9,BH73,IF($AK$4=$DB$10,BI73,IF($AK$4=$DB$11,BC73,IF($AK$4=$DB$12,BD73,IF($AK$4=$DB$13,BE73,IF($AK$4=$DB$14,BF73,\"\")))))))","v":0},0,null,{"$f":"COUNTIF($C$10:$AG$18,$AX73)","v":0},{"$f":"COUNTIF($C$22:$AG$30,$AX73)","v":0},{"$f":"COUNTIF($C$34:$AG$42,$AX73)","v":0},{"$f":"COUNTIF($C$46:$AG$54,$AX73)","v":0},{"$f":"SUM(BC73:BF73)","v":0},{"$f":"'Jan-Abr 2025'!BH73","v":0},{"$f":"'Jan-Abr 2025'!BG73+'Mai-Ago 2025'!BG73","v":0},{"$nulls":3},0,{"$f":"IF($AK$4=$DB$8,BU73,IF($AK$4=$DB$9,BV73,IF($AK$4=$DB$10,BW73,IF($AK$4=$DB$11,BQ73,IF($AK$4=$DB$12,BR73,IF($AK$4=$DB$13,BS73,IF($AK$4=$DB$14,BT73,\"\")))))))","v":0},0,null,{"$f":"COUNTIF($C$10:$AG$18,$BL73)","v":0},{"$f":"COUNTIF($C$22:$AG$30,$BL73)","v":0},{"$f":"COUNTIF($C$34:$AG$42,$BL73)","v":0},{"$f":"COUNTIF($C$46:$AG$54,$BL73)","v":0},{"$f":"SUM(BQ73:BT73)","v":0},{"$f":"'Jan-Abr 2025'!BV73","v":0},{"$f":"'Jan-Abr 2025'!BU73+'Mai-Ago 2025'!BU73","v":0}]
[null,6417,"SD","Sistemas Digitais",{"$nulls":5},"I159",50,{"$nulls":9},"Seg.","Ter.","Qua.","Qui.","Sex."]
[{"$nulls":19},"Salas:",{"$nulls":16},{"$f":"SUMIF(AI8:AI73,\"=M\",AK8:AK73)+SUMIF(AI8:AI73,\"=T\",AK8:AK73)","v":0},null,null,{"$f":"SUMIF(AI8:AI73,\"=M\",AN8:AN73)+SUMIF(AI8:AI73,\"=T\",AN8:AN73)","v":0},{"$nulls":10},{"$f":"SUMIF(AW8:AW73,\"=M\",AY8:AY73)+SUMIF(AW8:AW73,\"=T\",AY8:AY73)","v":0},null,null,{"$f":"SUMIF(AW8:AW73,\"=M\",BB8:BB73)+SUMIF(AW8:AW73,\"=T\",BB8:BB73)","v":0},{"$nulls":10},{"$f":"SUMIF(BK8:BK73,\"=M\",BM8:BM73)+SUMIF(BK8:BK73,\"=T\",BM8:BM73)","v":0},null,null,{"$f":"SUMIF(BK8:BK73,\"=M\",BP8:BP73)+SUMIF(BK8:BK73,\"=T\",BP8:BP73)","v":0}]
[{"$nulls":34},"Totais",null,{"$f":"AK75+AY75+BM75","v":0},null,null,{"$f":"AN75+BB75+BP75","v":0}]
["R. Quantitativas:"]

{"sheet":"Set-Dez 2025","index":3,"n_rows":77,"n_cols":107,"rows_kept":77,"merged":[[0,25,0,32],[0,34,2,39],[0,40,6,40],[0,41,6,41],[0,42,6,42],[0,43,6,43],[0,44,6,44],[0,45,6,45],[0,46,6,46],[0,48,2,53],[0,54,6,54],[0,55,6,55],[0,56,6,56],[0,57,6,57],[0,58,6,58],[0,59,6,59],[0,60,6,60],[0,62,2,67],[0,68,6,68],[0,69,6,69],[0,70,6,70],[0,71,6,71],[0,72,6,72],[0,73,6,73],[0,74,6,74],[0,105,6,105],[0,106,6,106],[1,25,1,32],[2,25,2,32],[3,25,3,32],[3,34,6,34],[3,35,6,35],[3,36,6,36],[3,37,6,37],[3,38,6,38],[3,39,6,39],[3,48,6,48],[3,49,6,49],[3,50,6,50],[3,51,6,51],[3,52,6,52],[3,53,6,53],[3,62,6,62],[3,63,6,63],[3,64,6,64],[3,65,6,65],[3,66,6,66],[3,67,6,67],[4,0,4,2],[4,3,4,9],[4,10,4,13],[4,14,4,21],[4,22,4,26],[4,27,4,29],[4,30,4,32],[5,0,5,2],[5,3,5,9],[5,10,5,13],[5,14,5,21],[5,22,5,26],[5,27,5,29],[5,30,5,32],[6,0,6,2],[6,3,6,9],[6,10,6,13],[6,14,6,21],[6,22,6,26],[6,27,6,29],[6,30,6,32],[7,0,8,1],[9,0,9,1],[10,0,10,1],[11,0,11,1],[12,0,12,1],[14,0,14,1],[15,0,15,1],[16,0,16,1],[17,0,17,1],[19,0,20,1],[21,0,21,1],[22,0,22,1],[23,0,23,1],[24,0,24,1],[25,0,25,1],[26,0,26,1],[27,0,27,1],[28,0,28,1],[29,0,29,1],[31,0,32,1],[33,0,33,1],[34,0,34,1],[35,0,35,1],[36,0,36,1],[37,0,37,1],[38,0,38,1],[39,0,39,1],[40,0,40,1],[41,0,41,1],[43,0,44,1],[45,0,45,1],[46,0,46,1],[47,0,47,1],[48,0,48,1],[49,0,49,1],[50,0,50,1],[51,0,51,1],[52,0,52,1],[53,0,53,1],[54,2,54,8],[54,11,54,13],[54,17,54,19],[54,20,54,25],[54,28,54,30],[55,0,60,0],[55,3,55,8],[55,11,55,13],[55,17,63,17],[55,20,55,25],[55,28,55,30],[56,3,56,8],[56,11,56,13],[56,20,56,25],[56,28,56,30],[57,3,57,8],[57,11,57,13],[57,20,57,25],[57,28,57,30],[58,3,58,8],[58,11,58,13],[58,20,58,25],[58,28,58,30],[59,3,59,8],[59,11,59,13],[59,20,59,25],[59,28,59,30],[60,3,60,8],[60,11,60,13],[60,20,60,25],[60,28,60,30],[61,20,61,25],[61,28,61,30],[62,20,62,25],[63,0,73,0],[63,3,63,8],[63,11,63,13],[63,20,63,25],[64,3,64,8],[64,11,64,13],[65,3,65,8],[65,11,65,13],[66,3,66,8],[66,11,66,13],[67,3,67,8],[67,11,67,13],[68,3,68,8],[68,11,68,13],[69,3,69,8],[69,11,69,13],[70,3,70,8],[70,11,70,13],[71,3,71,8],[71,11,71,13],[72,3,72,8],[72,11,72,13],[73,3,73,8],[73,11,73,13],[75,34,75,35],[76,2,76,3],[76,4,76,5],[76,6,76,7],[76,8,76,9],[76,10,76,11],[76,12,76,13]]}
[{"$nulls":40},{"$f":"TEXT($A$8,\"mmm\")","v":"set"},{"$f":"TEXT($A$20,\"mmm\")","v":"out"},{"$f":"TEXT($A$32,\"mmm\")","v":"nov"},{"$f":"TEXT($A$44,\"mmm\")","v":"dez"},"Total  Folha","Total Global","Total  Acum.",{"$nulls":7},{"$f":"TEXT($A$8,\"mmm\")","v":"set"},{"$f":"TEXT($A$20,\"mmm\")","v":"out"},{"$f":"TEXT($A$32,\"mmm\")","v":"nov"},{"$f":"TEXT($A$44,\"mmm\")","v":"dez"},"Total  Folha","Total Global","Total  Acum.",{"$nulls":7},{"$f":"TEXT($A$8,\"mmm\")","v":"set"},{"$f":"TEXT($A$20,\"mmm\")","v":"out"},{"$f":"TEXT($A$32,\"mmm\")","v":"nov"},{"$f":"TEXT($A$44,\"mmm\")","v":"dez"},"Total  Folha","Total Global","Total  Acum.",{"$nulls":30},"tipo_soma","tipo_contador"]
[{"$nulls":25},"Director(a):"]
[{"$nulls":25},"(Cristina Botas)"]
[{"$nulls":34},"Tipo","Módulo","ST","Origem","Cálculo","Objetivo",{"$nulls":8},"Tipo","Módulo",{"$f":"AK4","v":"ST"},"Origem","Cálculo","Objetivo",{"$nulls":8},"Tipo","Módulo",{"$f":"AK4","v":"ST"},"Origem","Cálculo","Objetivo"]
["MODALIDADE:",{"$nulls":9},"CODÍGO DA AÇÃO:",{"$nulls":16},"       U.O.:",null,null,"Torres Vedras"]
["PLANEAMENTO:",{"$nulls":9},"SAÍDA PROFISSIONAL: Técnico/a Especialista em Mecatrónica",{"$nulls":16},"DATA INÍCIO:"]
["COORDENADOR:",{"$nulls":9},"DURAÇÃO:",{"$nulls":16},"DATA FIM  (previsto):"]
["2025-09-01",null,{"$f":"IF(C9<>\"\",CHOOSE(WEEKDAY(C9,1),\"Dom.\",\"Seg.\",\"Ter.\",\"Qua.\",\"Qui.\",\"Sex.\",\"Sáb.\"),\"\")","v":"Seg."},{"$f":"IF(D9<>\"\",CHOOSE(WEEKDAY(D9,1),\"Dom.\",\"Seg.\",\"Ter.\",\"Qua.\",\"Qui.\",\"Sex.\",\"Sáb.\"),\"\")","v":"Ter."},"Qua.","Qui.","Sex.","Sáb.","Dom.","Seg.","Ter.","Qua.","Qui.","Sex.","Sáb.","Dom.","Seg.","Ter.","Qua.","Qui.","Sex.","Sáb.","Dom.","Seg.","Ter.","Qua.","Qui.","Sex.","Sáb.","Dom.","Seg.","Ter.","",null,null,"IGO",{"$f":"IF(AI8=$DC$8,AM8,IF(AI8=$DC$9,AM8,IF(AI8=$DC$10,AL8,)))","v":0},{"$f":"IF($AK$4=$DB$8,AS8,IF($AK$4=$DB$9,AT8,IF($AK$4=$DB$10,AU8,IF($AK$4=$DB$11,AO8,IF($AK$4=$DB$12,AP8,IF($AK$4=$DB$13,AQ8,IF($AK$4=$DB$14,AR8,\"\")))))))","v":0},{"$f":"IF(AI8=$DC$8,AL8,IF(AI8=$DC$9,AM9+AL8,IF(AI8=$DC$10,IF(AI9=$DC$10,AM9+AL8,AL8),)))","v":0},25,{"$f":"COUNTIF($C$10:$AG$18,$AJ8)","v":0},{"$f":"COUNTIF($C$22:$AG$30,$AJ8)","v":0},{"$f":"COUNTIF($C$34:$AG$42,$AJ8)","v":0},{"$f":"COUNTIF($C$46:$AG$54,$AJ8)","v":0},{"$f":"SUM(AO8:AR8)","v":0},{"$f":"'Jan-Abr 2025'!AT8","v":0},{"$f":"'Jan-Abr 2025'!AS8+'Mai-Ago 2025'!AS8+'Set-Dez 2025'!AS8","v":0},{"$nulls":3},{"$f":"IF(AW8=$DC$8,BA8,IF(AW8=$DC$9,BA8,IF(AW8=$DC$10,AZ8,)))","v":0},{"$f":"IF($AK$4=$DB$8,BG8,IF($AK$4=$DB$9,BH8,IF($AK$4=$DB$10,BI8,IF($AK$4=$DB$11,BC8,IF($AK$4=$DB$12,BD8,IF($AK$4=$DB$13,BE8,IF($AK$4=$DB$14,BF8,\"\")))))))","v":0},{"$f":"IF(AW8=$DC$8,AZ8,IF(AW8=$DC$9,BA9+AZ8,IF(AW8=$DC$10,IF(AW9=$DC$10,BA9+AZ8,AZ8),)))","v":0},null,{"$f":"COUNTIF($C$10:$AG$18,$AX8)","v":0},{"$f":"COUNTIF($C$22:$AG$30,$AX8)","v":0},{"$f":"COUNTIF($C$34:$AG$42,$AX8)","v":0},{"$f":"COUNTIF($C$46:$AG$54,$AX8)","v":0},{"$f":"SUM(BC8:BF8)","v":0},{"$f":"'Jan-Abr 2025'!BH8","v":0},{"$f":"'Jan-Abr 2025'!BG8+'Mai-Ago 2025'!BG8+'Set-Dez 2025'!BG8","v":0},{"$nulls":3},{"$f":"IF(BK8=$DC$8,BO8,IF(BK8=$DC$9,BO8,IF(BK8=$DC$10,BN8,)))","v":0},{"$f":"IF($AK$4=$DB$8,BU8,IF($AK$4=$DB$9,BV8,IF($AK$4=$DB$10,BW8,IF($AK$4=$DB$11,BQ8,IF($AK$4=$DB$12,BR8,IF($AK$4=$DB$13,BS8,IF($AK$4=$DB$14,BT8,\"\")))))))","v":0},{"$f":"IF(BK8=$DC$8,BN8,IF(BK8=$DC$9,BO9+BN8,IF(BK8=$DC$10,IF(BK9=$DC$10,BO9+BN8,BN8),)))","v":0},null,{"$f":"COUNTIF($C$10:$AG$18,$BL8)","v":0},{"$f":"COUNTIF($C$22:$AG$30,$BL8)","v":0},{"$f":"COUNTIF($C$34:$AG$42,$BL8)","v":0},{"$f":"COUNTIF($C$46:$AG$54,$BL8)","v":0},{"$f":"SUM(BQ8:BT8)","v":0},{"$f":"'Jan-Abr 2025'!BV8","v":0},{"$f":"'Jan-Abr 2025'!BU8+'Mai-Ago 2025'!BU8+'Set-Dez 2025'!BU8","v":0},{"$nulls":30},"SF","M"]
[null,null,{"$f":"A8","v":"2025-09-01"},{"$f":"IF(C9=\"\",\"\",IF(DAY(C9)<DAY(EOMONTH(C9,0)),C9+1,\"\"))","v":"2025-09-02"},{"$f":"IF(D9=\"\",\"\",IF(DAY(D9)<DAY(EOMONTH(D9,0)),D9+1,\"\"))","v":"2025-09-03"},"2025-09-04","2025-09-05","2025-09-06","2025-09-07","2025-09-08",{"$f":"IF(J9=\"\",\"\",IF(DAY(J9)<DAY(EOMONTH(J9,0)),J9+1,\"\"))","v":"2025-09-09"},{"$f":"IF(K9=\"\",\"\",IF(DAY(K9)<DAY(EOMONTH(K9,0)),K9+1,\"\"))","v":"2025-09-10"},"2025-09-11","2025-09-12","2025-09-13","2025-09-14","2025-09-15",{"$f":"IF(Q9=\"\",\"\",IF(DAY(Q9)<DAY(EOMONTH(Q9,0)),Q9+1,\"\"))","v":"2025-09-16"},{"$f":"IF(R9=\"\",\"\",IF(DAY(R9)<DAY(EOMONTH(R9,0)),R9+1,\"\"))","v":"2025-09-17"},"2025-09-18","2025-09-19","2025-09-20","2025-09-21","2025-09-22",{"$f":"IF(X9=\"\",\"\",IF(DAY(X9)<DAY(EOMONTH(X9,0)),X9+1,\"\"))","v":"2025-09-23"},{"$f":"IF(Y9=\"\",\"\",IF(DAY(Y9)<DAY(EOMONTH(Y9,0)),Y9+1,\"\"))","v":"2025-09-24"},"2025-09-25","2025-09-26","2025-09-27","2025-09-28","2025-09-29",{"$f":"IF(AE9=\"\",\"\",IF(DAY(AE9)<DAY(EOMONTH(AE9,0)),AE9+1,\"\"))","v":"2025-09-30"},{"$f":"IF(AF9=\"\",\"\",IF(DAY(AF9)<DAY(EOMONTH(AF9,0)),AF9+1,\"\"))","v":""},null,null,"GMQ",0,{"$f":"IF($AK$4=$DB$8,AS9,IF($AK$4=$DB$9,AT9,IF($AK$4=$DB$10,AU9,IF($AK$4=$DB$11,AO9,IF($AK$4=$DB$12,AP9,IF($AK$4=$DB$13,AQ9,IF($AK$4=$DB$14,AR9,\"\")))))))","v":0},0,25,{"$f":"COUNTIF($C$10:$AG$18,$AJ9)","v":0},{"$f":"COUNTIF($C$22:$AG$30,$AJ9)","v":0},{"$f":"COUNTIF($C$34:$AG$42,$AJ9)","v":0},{"$f":"COUNTIF($C$46:$AG$54,$AJ9)","v":0},0,{"$f":"'Jan-Abr 2025'!AT9","v":0},{"$f":"'Jan-Abr 2025'!AS9+'Mai-Ago 2025'!AS9+'Set-Dez 2025'!AS9","v":0},{"$nulls":3},0,{"$f":"IF($AK$4=$DB$8,BG9,IF($AK$4=$DB$9,BH9,IF($AK$4=$DB$10,BI9,IF($AK$4=$DB$11,BC9,IF($AK$4=$DB$12,BD9,IF($AK$4=$DB$13,BE9,IF($AK$4=$DB$14,BF9,\"\")))))))","v":0},0,null,{"$f":"COUNTIF($C$10:$AG$18,$AX9)","v":0},{"$f":"COUNTIF($C$22:$AG$30,$AX9)","v":0},{"$f":"COUNTIF($C$34:$AG$42,$AX9)","v":0},{"$f":"COUNTIF($C$46:$AG$54,$AX9)","v":0},{"$f":"SUM(BC9:BF9)","v":0},{"$f":"'Jan-Abr 2025'!BH9","v":0},{"$f":"'Jan-Abr 2025'!BG9+'Mai-Ago 2025'!BG9+'Set-Dez 2025'!BG9","v":0},{"$nulls":3},0,{"$f":"IF($AK$4=$DB$8,BU9,IF($AK$4=$DB$9,BV9,IF($AK$4=$DB$10,BW9,IF($AK$4=$DB$11,BQ9,IF($AK$4=$DB$12,BR9,IF($AK$4=$DB$13,BS9,IF($AK$4=$DB$14,BT9,\"\")))))))","v":0},0,null,{"$f":"COUNTIF($C$10:$AG$18,$BL9)","v":0},{"$f":"COUNTIF($C$22:$AG$30,$BL9)","v":0},{"$f":"COUNTIF($C$34:$AG$42,$BL9)","v":0},{"$f":"COUNTIF($C$46:$AG$54,$BL9)","v":0},0,{"$f":"'Jan-Abr 2025'!BV9","v":0},{"$f":"'Jan-Abr 2025'!BU9+'Mai-Ago 2025'!BU9+'Set-Dez 2025'!BU9","v":0},{"$nulls":30},"ST","T"]
["09h00 - 09h50",{"$nulls":34},"SGQ",0,0,0,25,0,0,0,0,0,{"$f":"'Jan-Abr 2025'!AT10","v":0},{"$f":"'Jan-Abr 2025'!AS10+'Mai-Ago 2025'!AS10+'Set-Dez 2025'!AS10","v":0},{"$nulls":3},0,0,0,null,0,0,0,0,0,{"$f":"'Jan-Abr 2025'!BH10","v":0},{"$f":"'Jan-Abr 2025'!BG10+'Mai-Ago 2025'!BG10+'Set-Dez 2025'!BG10","v":0},{"$nulls":3},0,0,0,null,0,0,0,0,0,{"$f":"'Jan-Abr 2025'!BV10","v":0},{"$f":"'Jan-Abr 2025'!BU10+'Mai-Ago 2025'!BU10+'Set-Dez 2025'!BU10","v":0},{"$nulls":30},"SA","P"]
["09h50 - 10h40",{"$nulls":34},"ASHST",0,0,0,25,0,0,0,0,0,{"$f":"'Jan-Abr 2025'!AT11","v":0},{"$f":"'Jan-Abr 2025'!AS11+'Mai-Ago 2025'!AS11+'Set-Dez 2025'!AS11","v":0},{"$nulls":3},0,0,0,null,0,0,0,0,0,{"$f":"'Jan-Abr 2025'!BH11","v":0},{"$f":"'Jan-Abr 2025'!BG11+'Mai-Ago 2025'!BG11+'Set-Dez 2025'!BG11","v":0},{"$nulls":3},0,0,0,null,0,0,0,0,0,{"$f":"'Jan-Abr 2025'!BV11","v":0},{"$f":"'Jan-Abr 2025'!BU11+'Mai-Ago 2025'!BU11+'Set-Dez 2025'!BU11","v":0},{"$nulls":30},{"$f":"TEXT(A8,\"mmm\")","v":"set"}]
["11h00 - 11h50",{"$nulls":34},"DT",0,0,0,25,0,0,0,0,0,{"$f":"'Jan-Abr 2025'!AT12","v":0},{"$f":"'Jan-Abr 2025'!AS12+'Mai-Ago 2025'!AS12+'Set-Dez 2025'!AS12","v":0},{"$nulls":3},0,0,0,null,0,0,0,0,0,{"$f":"'Jan-Abr 2025'!BH12","v":0},{"$f":"'Jan-Abr 2025'!BG12+'Mai-Ago 2025'!BG12+'Set-Dez 2025'!BG12","v":0},{"$nulls":3},0,0,0,null,0,0,0,0,0,{"$f":"'Jan-Abr 2025'!BV12","v":0},{"$f":"'Jan-Abr 2025'!BU12+'Mai-Ago 2025'!BU12+'Set-Dez 2025'!BU12","v":0},{"$nulls":30},{"$f":"TEXT(A20,\"mmm\")","v":"out"}]
["11h50 - 12h40",{"$nulls":34},"ICS",0,0,0,25,0,0,0,0,0,{"$f":"'Jan-Abr 2025'!AT13","v":0},{"$f":"'Jan-Abr 2025'!AS13+'Mai-Ago 2025'!AS13+'Set-Dez 2025'!AS13","v":0},{"$nulls":3},0,0,0,null,0,0,0,0,0,{"$f":"'Jan-Abr 2025'!BH13","v":0},{"$f":"'Jan-Abr 2025'!BG13+'Mai-Ago 2025'!BG13+'Set-Dez 2025'!BG13","v":0},{"$nulls":3},0,0,0,null,0,0,0,0,0,{"$f":"'Jan-Abr 2025'!BV13","v":0},{"$f":"'Jan-Abr 2025'!BU13+'Mai-Ago 2025'!BU13+'Set-Dez 2025'!BU13","v":0},{"$nulls":30},{"$f":"TEXT(A32,\"mmm\")","v":"nov"}]
[{"$nulls":36},0,0,0,null,0,0,0,0,0,{"$f":"'Jan-Abr 2025'!AT14","v":0},{"$f":"'Jan-Abr 2025'!AS14+'Mai-Ago 2025'!AS14+'Set-Dez 2025'!AS14","v":0},{"$nulls":3},0,0,0,null,0,0,0,0,0,{"$f":"'Jan-Abr 2025'!BH14","v":0},{"$f":"'Jan-Abr 2025'!BG14+'Mai-Ago 2025'!BG14+'Set-Dez 2025'!BG14","v":0},{"$nulls":3},0,0,0,null,0,0,0,0,0,{"$f":"'Jan-Abr 2025'!BV14","v":0},{"$f":"'Jan-Abr 2025'!BU14+'Mai-Ago 2025'!BU14+'Set-Dez 2025'!BU14","v":0},{"$nulls":30},{"$f":"TEXT(A44,\"mmm\")","v":"dez"}]
["14h00 - 14h50",{"$nulls":34},"PFL",0,0,0,25,0,0,0,0,0,{"$f":"'Jan-Abr 2025'!AT15","v":0},{"$f":"'Jan-Abr 2025'!AS15+'Mai-Ago 2025'!AS15+'Set-Dez 2025'!AS15","v":0},{"$nulls":3},0,0,0,null,0,0,0,0,0,{"$f":"'Jan-Abr 2025'!BH15","v":0},{"$f":"'Jan-Abr 2025'!BG15+'Mai-Ago 2025'!BG15+'Set-Dez 2025'!BG15","v":0},{"$nulls":3},0,0,0,null,0,0,0,0,0,{"$f":"'Jan-Abr 2025'!BV15","v":0},{"$f":"'Jan-Abr 2025'!BU15+'Mai-Ago 2025'!BU15+'Set-Dez 2025'!BU15","v":0}]
["14h50 - 15h40",{"$nulls":34},"PCC",0,0,0,25,0,0,0,0,0,{"$f":"'Jan-Abr 2025'!AT16","v":0},{"$f":"'Jan-Abr 2025'!AS16+'Mai-Ago 2025'!AS16+'Set-Dez 2025'!AS16","v":0},{"$nulls":3},0,0,0,null,0,0,0,0,0,{"$f":"'Jan-Abr 2025'!BH16","v":0},{"$f":"'Jan-Abr 2025'!BG16+'Mai-Ago 2025'!BG16+'Set-Dez 2025'!BG16","v":0},{"$nulls":3},0,0,0,null,0,0,0,0,0,{"$f":"'Jan-Abr 2025'!BV16","v":0},{"$f":"'Jan-Abr 2025'!BU16+'Mai-Ago 2025'!BU16+'Set-Dez 2025'!BU16","v":0}]
["16h00 - 16h50",{"$nulls":34},"PAA",0,0,0,25,0,0,0,0,0,{"$f":"'Jan-Abr 2025'!AT17","v":0},{"$f":"'Jan-Abr 2025'!AS17+'Mai-Ago 2025'!AS17+'Set-Dez 2025'!AS17","v":0},{"$nulls":3},0,0,0,null,0,0,0,0,0,{"$f":"'Jan-Abr 2025'!BH17","v":0},{"$f":"'Jan-Abr 2025'!BG17+'Mai-Ago 2025'!BG17+'Set-Dez 2025'!BG17","v":0},{"$nulls":3},0,0,0,null,0,0,0,0,0,{"$f":"'Jan-Abr 2025'!BV17","v":0},{"$f":"'Jan-Abr 2025'!BU17+'Mai-Ago 2025'!BU17+'Set-Dez 2025'!BU17","v":0}]
["16h50 - 17h40",{"$nulls":34},"IME",0,0,0,50,0,0,0,0,0,{"$f":"'Jan-Abr 2025'!AT18","v":0},{"$f":"'Jan-Abr 2025'!AS18+'Mai-Ago 2025'!AS18+'Set-Dez 2025'!AS18","v":0},{"$nulls":3},0,0,0,null,0,0,0,0,0,{"$f":"'Jan-Abr 2025'!BH18","v":0},{"$f":"'Jan-Abr 2025'!BG18+'Mai-Ago 2025'!BG18+'Set-Dez 2025'!BG18","v":0},{"$nulls":3},0,0,0,null,0,0,0,0,0,{"$f":"'Jan-Abr 2025'!BV18","v":0},{"$f":"'Jan-Abr 2025'!BU18+'Mai-Ago 2025'!BU18+'Set-Dez 2025'!BU18","v":0}]
[{"$nulls":35},"ELE",0,0,0,50,0,0,0,0,0,{"$f":"'Jan-Abr 2025'!AT19","v":0},{"$f":"'Jan-Abr 2025'!AS19+'Mai-Ago 2025'!AS19+'Set-Dez 2025'!AS19","v":0},{"$nulls":3},0,0,0,null,0,0,0,0,0,{"$f":"'Jan-Abr 2025'!BH19","v":0},{"$f":"'Jan-Abr 2025'!BG19+'Mai-Ago 2025'!BG19+'Set-Dez 2025'!BG19","v":0},{"$nulls":3},0,0,0,null,0,0,0,0,0,{"$f":"'Jan-Abr 2025'!BV19","v":0},{"$f":"'Jan-Abr 2025'!BU19+'Mai-Ago 2025'!BU19+'Set-Dez 2025'!BU19","v":0}]
[{"$f":"A8+DAY(EOMONTH(A8,0))","v":"2025-10-01"},null,{"$f":"IF(C21<>\"\",CHOOSE(WEEKDAY(C21,1),\"Dom.\",\"Seg.\",\"Ter.\",\"Qua.\",\"Qui.\",\"Sex.\",\"Sáb.\"),\"\")","v":"Qua."},{"$f":"IF(D21<>\"\",CHOOSE(WEEKDAY(D21,1),\"Dom.\",\"Seg.\",\"Ter.\",\"Qua.\",\"Qui.\",\"Sex.\",\"Sáb.\"),\"\")","v":"Qui."},"Sex.","Sáb.","Dom.","Seg.","Ter.","Qua.","Qui.","Sex.","Sáb.","Dom.","Seg.","Ter.","Qua.","Qui.","Sex.","Sáb.","Dom.","Seg.","Ter.","Qua.","Qui.","Sex.","Sáb.","Dom.","Seg.","Ter.","Qua.","Qui.","Sex.",null,null,"CP",0,0,0,25,0,0,0,0,0,{"$f":"'Jan-Abr 2025'!AT20","v":0},{"$f":"'Jan-Abr 2025'!AS20+'Mai-Ago 2025'!AS20+'Set-Dez 2025'!AS20","v":0},{"$nulls":3},0,0,0,null,0,0,0,0,0,{"$f":"'Jan-Abr 2025'!BH20","v":0},{"$f":"'Jan-Abr 2025'!BG20+'Mai-Ago 2025'!BG20+'Set-Dez 2025'!BG20","v":0},{"$nulls":3},0,0,0,null,0,0,0,0,0,{"$f":"'Jan-Abr 2025'!BV20","v":0},{"$f":"'Jan-Abr 2025'!BU20+'Mai-Ago 2025'!BU20+'Set-Dez 2025'!BU20","v":0}]
[null,null,{"$f":"A20","v":"2025-10-01"},{"$f":"IF(C21=\"\",\"\",IF(DAY(C21)<DAY(EOMONTH(C21,0)),C21+1,\"\"))","v":"2025-10-02"},"2025-10-03","2025-10-04","2025-10-05","2025-10-06","2025-10-07","2025-10-08","2025-10-09","2025-10-10","2025-10-11","2025-10-12","2025-10-13","2025-10-14","2025-10-15","2025-10-16","2025-10-17","2025-10-18","2025-10-19","2025-10-20","2025-10-21","2025-10-22","2025-10-23","2025-10-24","2025-10-25","2025-10-26","2025-10-27","2025-10-28","2025-10-29","2025-10-30","2025-10-31",null,null,"CH",0,0,0,25,0,0,0,0,0,{"$f":"'Jan-Abr 2025'!AT21","v":0},{"$f":"'Jan-Abr 2025'!AS21+'Mai-Ago 2025'!AS21+'Set-Dez 2025'!AS21","v":0},{"$nulls":3},0,0,0,null,0,0,0,0,0,{"$f":"'Jan-Abr 2025'!BH21","v":0},{"$f":"'Jan-Abr 2025'!BG21+'Mai-Ago 2025'!BG21+'Set-Dez 2025'!BG21","v":0},{"$nulls":3},0,0,0,null,0,0,0,0,0,{"$f":"'Jan-Abr 2025'!BV21","v":0},{"$f":"'Jan-Abr 2025'!BU21+'Mai-Ago 2025'!BU21+'Set-Dez 2025'!BU21","v":0}]
[{"$f":"A10","v":"09h00 - 09h50"},{"$nulls":34},"CLP",0,0,0,50,0,0,0,0,0,{"$f":"'Jan-Abr 2025'!AT22","v":0},{"$f":"'Jan-Abr 2025'!AS22+'Mai-Ago 2025'!AS22+'Set-Dez 2025'!AS22","v":0},{"$nulls":3},0,0,0,null,0,0,0,0,0,{"$f":"'Jan-Abr 2025'!BH22","v":0},{"$f":"'Jan-Abr 2025'!BG22+'Mai-Ago 2025'!BG22+'Set-Dez 2025'!BG22","v":0},{"$nulls":3},0,0,0,null,0,0,0,0,0,{"$f":"'Jan-Abr 2025'!BV22","v":0},{"$f":"'Jan-Abr 2025'!BU22+'Mai-Ago 2025'!BU22+'Set-Dez 2025'!BU22","v":0}]
[{"$f":"A11","v":"09h50 - 10h40"},{"$nulls":5},"Repúb.",{"$nulls":28},"DCM",0,0,0,50,0,0,0,0,0,{"$f":"'Jan-Abr 2025'!AT23","v":0},{"$f":"'Jan-Abr 2025'!AS23+'Mai-Ago 2025'!AS23+'Set-Dez 2025'!AS23","v":0},{"$nulls":3},0,0,0,null,0,0,0,0,0,{"$f":"'Jan-Abr 2025'!BH23","v":0},{"$f":"'Jan-Abr 2025'!BG23+'Mai-Ago 2025'!BG23+'Set-Dez 2025'!BG23","v":0},{"$nulls":3},0,0,0,null,0,0,0,0,0,{"$f":"'Jan-Abr 2025'!BV23","v":0},{"$f":"'Jan-Abr 2025'!BU23+'Mai-Ago 2025'!BU23+'Set-Dez 2025'!BU23","v":0}]
["11h00 - 11h50",{"$nulls":34},"CM",0,0,0,50,0,0,0,0,0,{"$f":"'Jan-Abr 2025'!AT24","v":0},{"$f":"'Jan-Abr 2025'!AS24+'Mai-Ago 2025'!AS24+'Set-Dez 2025'!AS24","v":0},{"$nulls":3},0,0,0,null,0,0,0,0,0,{"$f":"'Jan-Abr 2025'!BH24","v":0},{"$f":"'Jan-Abr 2025'!BG24+'Mai-Ago 2025'!BG24+'Set-Dez 2025'!BG24","v":0},{"$nulls":3},0,0,0,null,0,0,0,0,0,{"$f":"'Jan-Abr 2025'!BV24","v":0},{"$f":"'Jan-Abr 2025'!BU24+'Mai-Ago 2025'!BU24+'Set-Dez 2025'!BU24","v":0}]
["11h50 - 12h40",{"$nulls":34},"SD",0,0,0,50,0,0,0,0,0,{"$f":"'Jan-Abr 2025'!AT25","v":0},{"$f":"'Jan-Abr 2025'!AS25+'Mai-Ago 2025'!AS25+'Set-Dez 2025'!AS25","v":0},{"$nulls":3},0,0,0,null,0,0,0,0,0,{"$f":"'Jan-Abr 2025'!BH25","v":0},{"$f":"'Jan-Abr 2025'!BG25+'Mai-Ago 2025'!BG25+'Set-Dez 2025'!BG25","v":0},{"$nulls":3},0,0,0,null,0,0,0,0,0,{"$f":"'Jan-Abr 2025'!BV25","v":0},{"$f":"'Jan-Abr 2025'!BU25+'Mai-Ago 2025'!BU25+'Set-Dez 2025'!BU25","v":0}]
[{"$nulls":35},"OEM",0,0,0,50,0,0,0,0,0,{"$f":"'Jan-Abr 2025'!AT26","v":0},{"$f":"'Jan-Abr 2025'!AS26+'Mai-Ago 2025'!AS26+'Set-Dez 2025'!AS26","v":0},{"$nulls":3},0,0,0,null,0,0,0,0,0,{"$f":"'Jan-Abr 2025'!BH26","v":0},{"$f":"'Jan-Abr 2025'!BG26+'Mai-Ago 2025'!BG26+'Set-Dez 2025'!BG26","v":0},{"$nulls":3},0,0,0,null,0,0,0,0,0,{"$f":"'Jan-Abr 2025'!BV26","v":0},{"$f":"'Jan-Abr 2025'!BU26+'Mai-Ago 2025'!BU26+'Set-Dez 2025'!BU26","v":0}]
["14h00 - 14h50",{"$nulls":34},"GP",0,0,0,50,0,0,0,0,0,{"$f":"'Jan-Abr 2025'!AT27","v":0},{"$f":"'Jan-Abr 2025'!AS27+'Mai-Ago 2025'!AS27+'Set-Dez 2025'!AS27","v":0},{"$nulls":3},0,0,0,null,0,0,0,0,0,{"$f":"'Jan-Abr 2025'!BH27","v":0},{"$f":"'Jan-Abr 2025'!BG27+'Mai-Ago 2025'!BG27+'Set-Dez 2025'!BG27","v":0},{"$nulls":3},0,0,0,null,0,0,0,0,0,{"$f":"'Jan-Abr 2025'!BV27","v":0},{"$f":"'Jan-Abr 2025'!BU27+'Mai-Ago 2025'!BU27+'Set-Dez 2025'!BU27","v":0}]
["14h50 - 15h40",{"$nulls":34},"PP",0,0,0,50,0,0,0,0,0,{"$f":"'Jan-Abr 2025'!AT28","v":0},{"$f":"'Jan-Abr 2025'!AS28+'Mai-Ago 2025'!AS28+'Set-Dez 2025'!AS28","v":0},{"$nulls":3},0,0,0,null,0,0,0,0,0,{"$f":"'Jan-Abr 2025'!BH28","v":0},{"$f":"'Jan-Abr 2025'!BG28+'Mai-Ago 2025'!BG28+'Set-Dez 2025'!BG28","v":0},{"$nulls":3},0,0,0,null,0,0,0,0,0,{"$f":"'Jan-Abr 2025'!BV28","v":0},{"$f":"'Jan-Abr 2025'!BU28+'Mai-Ago 2025'!BU28+'Set-Dez 2025'!BU28","v":0}]
["16h00 - 16h50",{"$nulls":34},"GS",0,0,0,50,0,0,0,0,0,{"$f":"'Jan-Abr 2025'!AT29","v":0},{"$f":"'Jan-Abr 2025'!AS29+'Mai-Ago 2025'!AS29+'Set-Dez 2025'!AS29","v":0},{"$nulls":3},0,0,0,null,0,0,0,0,0,{"$f":"'Jan-Abr 2025'!BH29","v":0},{"$f":"'Jan-Abr 2025'!BG29+'Mai-Ago 2025'!BG29+'Set-Dez 2025'!BG29","v":0},{"$nulls":3},0,0,0,null,0,0,0,0,0,{"$f":"'Jan-Abr 2025'!BV29","v":0},{"$f":"'Jan-Abr 2025'!BU29+'Mai-Ago 2025'!BU29+'Set-Dez 2025'!BU29","v":0}]
["16h50 - 17h40",{"$nulls":34},"CGO",0,0,0,50,0,0,0,0,0,{"$f":"'Jan-Abr 2025'!AT30","v":0},{"$f":"'Jan-Abr 2025'!AS30+'Mai-Ago 2025'!AS30+'Set-Dez 2025'!AS30","v":0},{"$nulls":3},0,0,0,null,0,0,0,0,0,{"$f":"'Jan-Abr 2025'!BH30","v":0},{"$f":"'Jan-Abr 2025'!BG30+'Mai-Ago 2025'!BG30+'Set-Dez 2025'!BG30","v":0},{"$nulls":3},0,0,0,null,0,0,0,0,0,{"$f":"'Jan-Abr 2025'!BV30","v":0},{"$f":"'Jan-Abr 2025'!BU30+'Mai-Ago 2025'!BU30+'Set-Dez 2025'!BU30","v":0}]
[{"$nulls":35},"LOG",0,0,0,50,0,0,0,0,0,{"$f":"'Jan-Abr 2025'!AT31","v":0},{"$f":"'Jan-Abr 2025'!AS31+'Mai-Ago 2025'!AS31+'Set-Dez 2025'!AS31","v":0},{"$nulls":3},0,0,0,null,0,0,0,0,0,{"$f":"'Jan-Abr 2025'!BH31","v":0},{"$f":"'Jan-Abr 2025'!BG31+'Mai-Ago 2025'!BG31+'Set-Dez 2025'!BG31","v":0},{"$nulls":3},0,0,0,null,0,0,0,0,0,{"$f":"'Jan-Abr 2025'!BV31","v":0},{"$f":"'Jan-Abr 2025'!BU31+'Mai-Ago 2025'!BU31+'Set-Dez 2025'!BU31","v":0}]
[{"$f":"A20+DAY(EOMONTH(A20,0))","v":"2025-11-01"},null,{"$f":"IF(C33<>\"\",CHOOSE(WEEKDAY(C33,1),\"Dom.\",\"Seg.\",\"Ter.\",\"Qua.\",\"Qui.\",\"Sex.\",\"Sáb.\"),\"\")","v":"Sáb."},{"$f":"IF(D33<>\"\",CHOOSE(WEEKDAY(D33,1),\"Dom.\",\"Seg.\",\"Ter.\",\"Qua.\",\"Qui.\",\"Sex.\",\"Sáb.\"),\"\")","v":"Dom."},"Seg.","Ter.","Qua.","Qui.","Sex.","Sáb.","Dom.","Seg.","Ter.","Qua.","Qui.","Sex.","Sáb.","Dom.","Seg.","Ter.","Qua.","Qui.","Sex.","Sáb.","Dom.","Seg.","Ter.","Qua.","Qui.","Sex.","Sáb.","Dom.","",null,null,"MOT",0,0,0,50,0,0,0,0,0,{"$f":"'Jan-Abr 2025'!AT32","v":0},{"$f":"'Jan-Abr 2025'!AS32+'Mai-Ago 2025'!AS32+'Set-Dez 2025'!AS32","v":0},{"$nulls":3},0,0,0,null,0,0,0,0,0,{"$f":"'Jan-Abr 2025'!BH32","v":0},{"$f":"'Jan-Abr 2025'!BG32+'Mai-Ago 2025'!BG32+'Set-Dez 2025'!BG32","v":0},{"$nulls":3},0,0,0,null,0,0,0,0,0,{"$f":"'Jan-Abr 2025'!BV32","v":0},{"$f":"'Jan-Abr 2025'!BU32+'Mai-Ago 2025'!BU32+'Set-Dez 2025'!BU32","v":0}]
[null,null,{"$f":"A32","v":"2025-11-01"},{"$f":"IF(C33=\"\",\"\",IF(DAY(C33)<DAY(EOMONTH(C33,0)),C33+1,\"\"))","v":"2025-11-02"},"2025-11-03","2025-11-04","2025-11-05","2025-11-06","2025-11-07","2025-11-08","2025-11-09","2025-11-10","2025-11-11","2025-11-12","2025-11-13","2025-11-14","2025-11-15","2025-11-16","2025-11-17","2025-11-18","2025-11-19","2025-11-20","2025-11-21","2025-11-22","2025-11-23","2025-11-24","2025-11-25","2025-11-26","2025-11-27","2025-11-28","2025-11-29","2025-11-30","",null,null,"SGI",0,0,0,25,0,0,0,0,0,{"$f":"'Jan-Abr 2025'!AT33","v":0},{"$f":"'Jan-Abr 2025'!AS33+'Mai-Ago 2025'!AS33+'Set-Dez 2025'!AS33","v":0},{"$nulls":3},0,0,0,null,0,0,0,0,0,{"$f":"'Jan-Abr 2025'!BH33","v":0},{"$f":"'Jan-Abr 2025'!BG33+'Mai-Ago 2025'!BG33+'Set-Dez 2025'!BG33","v":0},{"$nulls":3},0,0,0,null,0,0,0,0,0,{"$f":"'Jan-Abr 2025'!BV33","v":0},{"$f":"'Jan-Abr 2025'!BU33+'Mai-Ago 2025'!BU33+'Set-Dez 2025'!BU33","v":0}]
[{"$f":"A22","v":"09h00 - 09h50"},{"$nulls":34},"QCEP",0,0,0,50,0,0,0,0,0,{"$f":"'Jan-Abr 2025'!AT34","v":0},{"$f":"'Jan-Abr 2025'!AS34+'Mai-Ago 2025'!AS34+'Set-Dez 2025'!AS34","v":0},{"$nulls":3},0,0,0,null,0,0,0,0,0,{"$f":"'Jan-Abr 2025'!BH34","v":0},{"$f":"'Jan-Abr 2025'!BG34+'Mai-Ago 2025'!BG34+'Set-Dez 2025'!BG34","v":0},{"$nulls":3},0,0,0,null,0,0,0,0,0,{"$f":"'Jan-Abr 2025'!BV34","v":0},{"$f":"'Jan-Abr 2025'!BU34+'Mai-Ago 2025'!BU34+'Set-Dez 2025'!BU34","v":0}]
[{"$f":"A23","v":"09h50 - 10h40"},null,"Todos",{"$nulls":9},"São",{"$nulls":23},0,0,0,null,0,0,0,0,0,{"$f":"'Jan-Abr 2025'!AT35","v":0},{"$f":"'Jan-Abr 2025'!AS35+'Mai-Ago 2025'!AS35+'Set-Dez 2025'!AS35","v":0},{"$nulls":3},0,0,0,null,0,0,0,0,0,{"$f":"'Jan-Abr 2025'!BH35","v":0},{"$f":"'Jan-Abr 2025'!BG35+'Mai-Ago 2025'!BG35+'Set-Dez 2025'!BG35","v":0},{"$nulls":3},0,0,0,null,0,0,0,0,0,{"$f":"'Jan-Abr 2025'!BV35","v":0},{"$f":"'Jan-Abr 2025'!BU35+'Mai-Ago 2025'!BU35+'Set-Dez 2025'!BU35","v":0}]
["11h00 - 11h50",null,"Santos",{"$nulls":9},"Marti.",{"$nulls":23},0,0,0,null,0,0,0,0,0,{"$f":"'Jan-Abr 2025'!AT36","v":0},{"$f":"'Jan-Abr 2025'!AS36+'Mai-Ago 2025'!AS36+'Set-Dez 2025'!AS36","v":0},{"$nulls":3},0,0,0,null,0,0,0,0,0,{"$f":"'Jan-Abr 2025'!BH36","v":0},{"$f":"'Jan-Abr 2025'!BG36+'Mai-Ago 2025'!BG36+'Set-Dez 2025'!BG36","v":0},{"$nulls":3},0,0,0,null,0,0,0,0,0,{"$f":"'Jan-Abr 2025'!BV36","v":0},{"$f":"'Jan-Abr 2025'!BU36+'Mai-Ago 2025'!BU36+'Set-Dez 2025'!BU36","v":0}]
["11h50 - 12h40",{"$nulls":35},0,0,0,null,0,0,0,0,0,{"$f":"'Jan-Abr 2025'!AT37","v":0},{"$f":"'Jan-Abr 2025'!AS37+'Mai-Ago 2025'!AS37+'Set-Dez 2025'!AS37","v":0},{"$nulls":3},0,0,0,null,0,0,0,0,0,{"$f":"'Jan-Abr 2025'!BH37","v":0},{"$f":"'Jan-Abr 2025'!BG37+'Mai-Ago 2025'!BG37+'Set-Dez 2025'!BG37","v":0},{"$nulls":3},0,0,0,null,0,0,0,0,0,{"$f":"'Jan-Abr 2025'!BV37","v":0},{"$f":"'Jan-Abr 2025'!BU37+'Mai-Ago 2025'!BU37+'Set-Dez 2025'!BU37","v":0}]
[{"$nulls":36},0,0,0,null,0,0,0,0,0,{"$f":"'Jan-Abr 2025'!AT38","v":0},{"$f":"'Jan-Abr 2025'!AS38+'Mai-Ago 2025'!AS38+'Set-Dez 2025'!AS38","v":0},{"$nulls":3},0,0,0,null,0,0,0,0,0,{"$f":"'Jan-Abr 2025'!BH38","v":0},{"$f":"'Jan-Abr 2025'!BG38+'Mai-Ago 2025'!BG38+'Set-Dez 2025'!BG38","v":0},{"$nulls":3},0,0,0,null,0,0,0,0,0,{"$f":"'Jan-Abr 2025'!BV38","v":0},{"$f":"'Jan-Abr 2025'!BU38+'Mai-Ago 2025'!BU38+'Set-Dez 2025'!BU38","v":0}]
["14h00 - 14h50",{"$nulls":35},0,0,0,null,0,0,0,0,0,{"$f":"'Jan-Abr 2025'!AT39","v":0},{"$f":"'Jan-Abr 2025'!AS39+'Mai-Ago 2025'!AS39+'Set-Dez 2025'!AS39","v":0},{"$nulls":3},0,0,0,null,0,0,0,0,0,{"$f":"'Jan-Abr 2025'!BH39","v":0},{"$f":"'Jan-Abr 2025'!BG39+'Mai-Ago 2025'!BG39+'Set-Dez 2025'!BG39","v":0},{"$nulls":3},0,0,0,null,0,0,0,0,0,{"$f":"'Jan-Abr 2025'!BV39","v":0},{"$f":"'Jan-Abr 2025'!BU39+'Mai-Ago 2025'!BU39+'Set-Dez 2025'!BU39","v":0}]
["14h50 - 15h40",{"$nulls":35},0,0,0,null,0,0,0,0,{"$f":"SUM(AO40:AR40)","v":0},{"$f":"'Jan-Abr 2025'!AT40","v":0},{"$f":"'Jan-Abr 2025'!AS40+'Mai-Ago 2025'!AS40+'Set-Dez 2025'!AS40","v":0},{"$nulls":3},0,0,0,null,0,0,0,0,0,{"$f":"'Jan-Abr 2025'!BH40","v":0},{"$f":"'Jan-Abr 2025'!BG40+'Mai-Ago 2025'!BG40+'Set-Dez 2025'!BG40","v":0},{"$nulls":3},0,0,0,null,0,0,0,0,{"$f":"SUM(BQ40:BT40)","v":0},{"$f":"'Jan-Abr 2025'!BV40","v":0},{"$f":"'Jan-Abr 2025'!BU40+'Mai-Ago 2025'!BU40+'Set-Dez 2025'!BU40","v":0}]
["16h00 - 16h50",{"$nulls":35},0,0,0,null,0,0,0,0,0,{"$f":"'Jan-Abr 2025'!AT41","v":0},{"$f":"'Jan-Abr 2025'!AS41+'Mai-Ago 2025'!AS41+'Set-Dez 2025'!AS41","v":0},{"$nulls":3},0,0,0,null,0,0,0,0,0,{"$f":"'Jan-Abr 2025'!BH41","v":0},{"$f":"'Jan-Abr 2025'!BG41+'Mai-Ago 2025'!BG41+'Set-Dez 2025'!BG41","v":0},{"$nulls":3},0,0,0,null,0,0,0,0,0,{"$f":"'Jan-Abr 2025'!BV41","v":0},{"$f":"'Jan-Abr 2025'!BU41+'Mai-Ago 2025'!BU41+'Set-Dez 2025'!BU41","v":0}]
["16h50 - 17h40",{"$nulls":35},0,0,0,null,0,0,0,0,0,{"$f":"'Jan-Abr 2025'!AT42","v":0},{"$f":"'Jan-Abr 2025'!AS42+'Mai-Ago 2025'!AS42+'Set-Dez 2025'!AS42","v":0},{"$nulls":3},0,0,0,null,0,0,0,0,0,{"$f":"'Jan-Abr 2025'!BH42","v":0},{"$f":"'Jan-Abr 2025'!BG42+'Mai-Ago 2025'!BG42+'Set-Dez 2025'!BG42","v":0},{"$nulls":3},0,0,0,null,0,0,0,0,0,{"$f":"'Jan-Abr 2025'!BV42","v":0},{"$f":"'Jan-Abr 2025'!BU42+'Mai-Ago 2025'!BU42+'Set-Dez 2025'!BU42","v":0}]
[{"$nulls":36},0,0,0,null,0,0,0,0,0,{"$f":"'Jan-Abr 2025'!AT43","v":0},{"$f":"'Jan-Abr 2025'!AS43+'Mai-Ago 2025'!AS43+'Set-Dez 2025'!AS43","v":0},{"$nulls":3},0,0,0,null,0,0,0,0,0,{"$f":"'Jan-Abr 2025'!BH43","v":0},{"$f":"'Jan-Abr 2025'!BG43+'Mai-Ago 2025'!BG43+'Set-Dez 2025'!BG43","v":0},{"$nulls":3},0,0,0,null,0,0,0,0,0,{"$f":"'Jan-Abr 2025'!BV43","v":0},{"$f":"'Jan-Abr 2025'!BU43+'Mai-Ago 2025'!BU43+'Set-Dez 2025'!BU43","v":0}]
[{"$f":"A32+DAY(EOMONTH(A32,0))","v":"2025-12-01"},null,{"$f":"IF(C45<>\"\",CHOOSE(WEEKDAY(C45,1),\"Dom.\",\"Seg.\",\"Ter.\",\"Qua.\",\"Qui.\",\"Sex.\",\"Sáb.\"),\"\")","v":"Seg."},{"$f":"IF(D45<>\"\",CHOOSE(WEEKDAY(D45,1),\"Dom.\",\"Seg.\",\"Ter.\",\"Qua.\",\"Qui.\",\"Sex.\",\"Sáb.\"),\"\")","v":"Ter."},"Qua.","Qui.","Sex.","Sáb.","Dom.","Seg.","Ter.","Qua.","Qui.","Sex.","Sáb.","Dom.","Seg.","Ter.","Qua.","Qui.","Sex.","Sáb.","Dom.","Seg.","Ter.","Qua.","Qui.","Sex.","Sáb.","Dom.","Seg.","Ter.","Qua.",{"$nulls":3},0,0,0,null,0,0,0,0,0,{"$f":"'Jan-Abr 2025'!AT44","v":0},{"$f":"'Jan-Abr 2025'!AS44+'Mai-Ago 2025'!AS44+'Set-Dez 2025'!AS44","v":0},{"$nulls":3},0,0,0,null,0,0,0,0,0,{"$f":"'Jan-Abr 2025'!BH44","v":0},{"$f":"'Jan-Abr 2025'!BG44+'Mai-Ago 2025'!BG44+'Set-Dez 2025'!BG44","v":0},{"$nulls":3},0,0,0,null,0,0,0,0,0,{"$f":"'Jan-Abr 2025'!BV44","v":0},{"$f":"'Jan-Abr 2025'!BU44+'Mai-Ago 2025'!BU44+'Set-Dez 2025'!BU44","v":0}]
[null,null,{"$f":"A44","v":"2025-12-01"},{"$f":"IF(C45=\"\",\"\",IF(DAY(C45)<DAY(EOMONTH(C45,0)),C45+1,\"\"))","v":"2025-12-02"},"2025-12-03","2025-12-04","2025-12-05","2025-12-06","2025-12-07","2025-12-08","2025-12-09","2025-12-10","2025-12-11","2025-12-12","2025-12-13","2025-12-14","2025-12-15","2025-12-16","2025-12-17","2025-12-18","2025-12-19","2025-12-20","2025-12-21","2025-12-22","2025-12-23","2025-12-24","2025-12-25","2025-12-26","2025-12-27","2025-12-28","2025-12-29","2025-12-30","2025-12-31",{"$nulls":3},0,0,0,null,0,0,0,0,0,{"$f":"'Jan-Abr 2025'!AT45","v":0},{"$f":"'Jan-Abr 2025'!AS45+'Mai-Ago 2025'!AS45+'Set-Dez 2025'!AS45","v":0},{"$nulls":3},0,0,0,null,0,0,0,0,0,{"$f":"'Jan-Abr 2025'!BH45","v":0},{"$f":"'Jan-Abr 2025'!BG45+'Mai-Ago 2025'!BG45+'Set-Dez 2025'!BG45","v":0},{"$nulls":3},0,0,0,null,0,0,0,0,0,{"$f":"'Jan-Abr 2025'!BV45","v":0},{"$f":"'Jan-Abr 2025'!BU45+'Mai-Ago 2025'!BU45+'Set-Dez 2025'!BU45","v":0}]
[{"$f":"A10","v":"09h00 - 09h50"},{"$nulls":35},0,0,0,null,0,0,0,0,0,{"$f":"'Jan-Abr 2025'!AT46","v":0},{"$f":"'Jan-Abr 2025'!AS46+'Mai-Ago 2025'!AS46+'Set-Dez 2025'!AS46","v":0},{"$nulls":3},0,0,0,null,0,0,0,0,0,{"$f":"'Jan-Abr 2025'!BH46","v":0},{"$f":"'Jan-Abr 2025'!BG46+'Mai-Ago 2025'!BG46+'Set-Dez 2025'!BG46","v":0},{"$nulls":3},0,0,0,null,0,0,0,0,0,{"$f":"'Jan-Abr 2025'!BV46","v":0},{"$f":"'Jan-Abr 2025'!BU46+'Mai-Ago 2025'!BU46+'Set-Dez 2025'!BU46","v":0}]
[{"$f":"A11","v":"09h50 - 10h40"},null,"Rest.",{"$nulls":6},"Imacu.",{"$nulls":16},"Natal",{"$nulls":9},0,0,0,null,0,0,0,0,0,{"$f":"'Jan-Abr 2025'!AT47","v":0},{"$f":"'Jan-Abr 2025'!AS47+'Mai-Ago 2025'!AS47+'Set-Dez 2025'!AS47","v":0},{"$nulls":3},0,0,0,null,0,0,0,0,0,{"$f":"'Jan-Abr 2025'!BH47","v":0},{"$f":"'Jan-Abr 2025'!BG47+'Mai-Ago 2025'!BG47+'Set-Dez 2025'!BG47","v":0},{"$nulls":3},0,0,0,null,0,0,0,0,0,{"$f":"'Jan-Abr 2025'!BV47","v":0},{"$f":"'Jan-Abr 2025'!BU47+'Mai-Ago 2025'!BU47+'Set-Dez 2025'!BU47","v":0}]
["11h00 - 11h50",null,"Indep.",{"$nulls":6},"Concei.",{"$nulls":26},0,0,0,null,0,0,0,0,0,{"$f":"'Jan-Abr 2025'!AT48","v":0},{"$f":"'Jan-Abr 2025'!AS48+'Mai-Ago 2025'!AS48+'Set-Dez 2025'!AS48","v":0},{"$nulls":3},0,0,0,null,0,0,0,0,0,{"$f":"'Jan-Abr 2025'!BH48","v":0},{"$f":"'Jan-Abr 2025'!BG48+'Mai-Ago 2025'!BG48+'Set-Dez 2025'!BG48","v":0},{"$nulls":3},0,0,0,null,0,0,0,0,0,{"$f":"'Jan-Abr 2025'!BV48","v":0},{"$f":"'Jan-Abr 2025'!BU48+'Mai-Ago 2025'!BU48+'Set-Dez 2025'!BU48","v":0}]
["11h50 - 12h40",{"$nulls":35},0,0,0,null,0,0,0,0,0,{"$f":"'Jan-Abr 2025'!AT49","v":0},{"$f":"'Jan-Abr 2025'!AS49+'Mai-Ago 2025'!AS49+'Set-Dez 2025'!AS49","v":0},{"$nulls":3},0,0,0,null,0,0,0,0,0,{"$f":"'Jan-Abr 2025'!BH49","v":0},{"$f":"'Jan-Abr 2025'!BG49+'Mai-Ago 2025'!BG49+'Set-Dez 2025'!BG49","v":0},{"$nulls":3},0,0,0,null,0,0,0,0,0,{"$f":"'Jan-Abr 2025'!BV49","v":0},{"$f":"'Jan-Abr 2025'!BU49+'Mai-Ago 2025'!BU49+'Set-Dez 2025'!BU49","v":0}]
[{"$nulls":36},0,0,0,null,0,0,0,0,0,{"$f":"'Jan-Abr 2025'!AT50","v":0},{"$f":"'Jan-Abr 2025'!AS50+'Mai-Ago 2025'!AS50+'Set-Dez 2025'!AS50","v":0},{"$nulls":3},0,0,0,null,0,0,0,0,0,{"$f":"'Jan-Abr 2025'!BH50","v":0},{"$f":"'Jan-Abr 2025'!BG50+'Mai-Ago 2025'!BG50+'Set-Dez 2025'!BG50","v":0},{"$nulls":3},0,0,0,null,0,0,0,0,0,{"$f":"'Jan-Abr 2025'!BV50","v":0},{"$f":"'Jan-Abr 2025'!BU50+'Mai-Ago 2025'!BU50+'Set-Dez 2025'!BU50","v":0}]
["14h00 - 14h50",{"$nulls":35},0,0,0,null,0,0,0,0,0,{"$f":"'Jan-Abr 2025'!AT51","v":0},{"$f":"'Jan-Abr 2025'!AS51+'Mai-Ago 2025'!AS51+'Set-Dez 2025'!AS51","v":0},{"$nulls":3},0,0,0,null,0,0,0,0,0,{"$f":"'Jan-Abr 2025'!BH51","v":0},{"$f":"'Jan-Abr 2025'!BG51+'Mai-Ago 2025'!BG51+'Set-Dez 2025'!BG51","v":0},{"$nulls":3},0,0,0,null,0,0,0,0,0,{"$f":"'Jan-Abr 2025'!BV51","v":0},{"$f":"'Jan-Abr 2025'!BU51+'Mai-Ago 2025'!BU51+'Set-Dez 2025'!BU51","v":0}]
["14h50 - 15h40",{"$nulls":35},0,0,0,null,0,0,0,0,0,{"$f":"'Jan-Abr 2025'!AT52","v":0},{"$f":"'Jan-Abr 2025'!AS52+'Mai-Ago 2025'!AS52+'Set-Dez 2025'!AS52","v":0},{"$nulls":3},0,0,0,null,0,0,0,0,0,{"$f":"'Jan-Abr 2025'!BH52","v":0},{"$f":"'Jan-Abr 2025'!BG52+'Mai-Ago 2025'!BG52+'Set-Dez 2025'!BG52","v":0},{"$nulls":3},0,0,0,null,0,0,0,0,0,{"$f":"'Jan-Abr 2025'!BV52","v":0},{"$f":"'Jan-Abr 2025'!BU52+'Mai-Ago 2025'!BU52+'Set-Dez 2025'!BU52","v":0}]
["16h00 - 16h50",{"$nulls":35},0,0,0,null,0,0,0,0,0,{"$f":"'Jan-Abr 2025'!AT53","v":0},{"$f":"'Jan-Abr 2025'!AS53+'Mai-Ago 2025'!AS53+'Set-Dez 2025'!AS53","v":0},{"$nulls":3},0,0,0,null,0,0,0,0,0,{"$f":"'Jan-Abr 2025'!BH53","v":0},{"$f":"'Jan-Abr 2025'!BG53+'Mai-Ago 2025'!BG53+'Set-Dez 2025'!BG53","v":0},{"$nulls":3},0,0,0,null,0,0,0,0,0,{"$f":"'Jan-Abr 2025'!BV53","v":0},{"$f":"'Jan-Abr 2025'!BU53+'Mai-Ago 2025'!BU53+'Set-Dez 2025'!BU53","v":0}]
["16h50 - 17h40",{"$nulls":35},0,0,0,null,0,0,0,0,0,{"$f":"'Jan-Abr 2025'!AT54","v":0},{"$f":"'Jan-Abr 2025'!AS54+'Mai-Ago 2025'!AS54+'Set-Dez 2025'!AS54","v":0},{"$nulls":3},0,0,0,null,0,0,0,0,0,{"$f":"'Jan-Abr 2025'!BH54","v":0},{"$f":"'Jan-Abr 2025'!BG54+'Mai-Ago 2025'!BG54+'Set-Dez 2025'!BG54","v":0},{"$nulls":3},0,0,0,null,0,0,0,0,0,{"$f":"'Jan-Abr 2025'!BV54","v":0},{"$f":"'Jan-Abr 2025'!BU54+'Mai-Ago 2025'!BU54+'Set-Dez 2025'!BU54","v":0}]
[{"$nulls":32},"Fim",null,null,"PCT",0,0,0,560,0,0,0,0,0,{"$f":"'Jan-Abr 2025'!AT55","v":0},{"$f":"'Jan-Abr 2025'!AS55+'Mai-Ago 2025'!AS55+'Set-Dez 2025'!AS55","v":0},{"$nulls":3},0,0,0,null,0,0,0,0,0,{"$f":"'Jan-Abr 2025'!BH55","v":0},{"$f":"'Jan-Abr 2025'!BG55+'Mai-Ago 2025'!BG55+'Set-Dez 2025'!BG55","v":0},{"$nulls":3},0,0,0,null,0,0,0,0,0,{"$f":"'Jan-Abr 2025'!BV55","v":0},{"$f":"'Jan-Abr 2025'!BU55+'Mai-Ago 2025'!BU55+'Set-Dez 2025'!BU55","v":0}]
["Sociocultural",5146,"IGO","Introdução à Gestão das Organizações",{"$nulls":5},"B153",25,{"$nulls":7},6418,"OEM","Órgãos e Elementos de Máquinas",{"$nulls":5},"C591",50,{"$nulls":8},0,0,0,null,0,0,0,0,0,{"$f":"'Jan-Abr 2025'!AT56","v":0},{"$f":"'Jan-Abr 2025'!AS56+'Mai-Ago 2025'!AS56+'Set-Dez 2025'!AS56","v":0},{"$nulls":3},0,0,0,null,0,0,0,0,0,{"$f":"'Jan-Abr 2025'!BH56","v":0},{"$f":"'Jan-Abr 2025'!BG56+'Mai-Ago 2025'!BG56+'Set-Dez 2025'!BG56","v":0},{"$nulls":3},0,0,0,null,0,0,0,0,0,{"$f":"'Jan-Abr 2025'!BV56","v":0},{"$f":"'Jan-Abr 2025'!BU56+'Mai-Ago 2025'!BU56+'Set-Dez 2025'!BU56","v":0}]
[null,5152,"GMQ","Gestão e Motivação para a Qualidade",{"$nulls":5},"B155",25,{"$nulls":7},"6442","GP","Gestão de Projetos",{"$nulls":6},50,{"$nulls":8},0,0,0,null,0,0,0,0,0,{"$f":"'Jan-Abr 2025'!AT57","v":0},{"$f":"'Jan-Abr 2025'!AS57+'Mai-Ago 2025'!AS57+'Set-Dez 2025'!AS57","v":0},{"$nulls":3},0,0,0,null,0,0,0,0,0,{"$f":"'Jan-Abr 2025'!BH57","v":0},{"$f":"'Jan-Abr 2025'!BG57+'Mai-Ago 2025'!BG57+'Set-Dez 2025'!BG57","v":0},{"$nulls":3},0,0,0,null,0,0,0,0,0,{"$f":"'Jan-Abr 2025'!BV57","v":0},{"$f":"'Jan-Abr 2025'!BU57+'Mai-Ago 2025'!BU57+'Set-Dez 2025'!BU57","v":0}]
[null,5149,"SGQ","Sistama de Gestão da Qualidade ISO 9001",{"$nulls":5},"F369",25,{"$nulls":7},"6443","PP","Planeamento da Produção",{"$nulls":6},50,{"$nulls":8},0,0,0,null,0,0,0,0,0,{"$f":"'Jan-Abr 2025'!AT58","v":0},{"$f":"'Jan-Abr 2025'!AS58+'Mai-Ago 2025'!AS58+'Set-Dez 2025'!AS58","v":0},{"$nulls":3},0,0,0,null,0,0,0,0,0,{"$f":"'Jan-Abr 2025'!BH58","v":0},{"$f":"'Jan-Abr 2025'!BG58+'Mai-Ago 2025'!BG58+'Set-Dez 2025'!BG58","v":0},{"$nulls":3},0,0,0,null,0,0,0,0,0,{"$f":"'Jan-Abr 2025'!BV58","v":0},{"$f":"'Jan-Abr 2025'!BU58+'Mai-Ago 2025'!BU58+'Set-Dez 2025'!BU58","v":0}]
[null,349,"ASHST","Ambiente, Segurança, Higiene e Saúde no Trabalho",{"$nulls":5},"F423",25,{"$nulls":7},"6444","GS","Gestão de Stocks - Metodologias",{"$nulls":6},50,{"$nulls":8},0,0,0,null,0,0,0,0,0,{"$f":"'Jan-Abr 2025'!AT59","v":0},{"$f":"'Jan-Abr 2025'!AS59+'Mai-Ago 2025'!AS59+'Set-Dez 2025'!AS59","v":0},{"$nulls":3},0,0,0,null,0,0,0,0,0,{"$f":"'Jan-Abr 2025'!BH59","v":0},{"$f":"'Jan-Abr 2025'!BG59+'Mai-Ago 2025'!BG59+'Set-Dez 2025'!BG59","v":0},{"$nulls":3},0,0,0,null,0,0,0,0,0,{"$f":"'Jan-Abr 2025'!BV59","v":0},{"$f":"'Jan-Abr 2025'!BU59+'Mai-Ago 2025'!BU59+'Set-Dez 2025'!BU59","v":0}]
[null,5653,"DT","Direito do Trabalho",{"$nulls":5},"B154",25,{"$nulls":7},"1054","CGO","Custeio e Gestão Orçamental",{"$nulls":6},50,{"$nulls":8},0,0,0,null,0,0,0,0,0,{"$f":"'Jan-Abr 2025'!AT60","v":0},{"$f":"'Jan-Abr 2025'!AS60+'Mai-Ago 2025'!AS60+'Set-Dez 2025'!AS60","v":0},{"$nulls":3},0,0,0,null,0,0,0,0,0,{"$f":"'Jan-Abr 2025'!BH60","v":0},{"$f":"'Jan-Abr 2025'!BG60+'Mai-Ago 2025'!BG60+'Set-Dez 2025'!BG60","v":0},{"$nulls":3},0,0,0,null,0,0,0,0,0,{"$f":"'Jan-Abr 2025'!BV60","v":0},{"$f":"'Jan-Abr 2025'!BU60+'Mai-Ago 2025'!BU60+'Set-Dez 2025'!BU60","v":0}]
[null,5768,"ICS","Inglês em Contexto Socioprofissional",{"$nulls":5},"L046",25,{"$nulls":7},"6445","LOG","Logistica ",{"$nulls":6},50,{"$nulls":8},0,0,0,null,0,0,0,0,0,{"$f":"'Jan-Abr 2025'!AT61","v":0},{"$f":"'Jan-Abr 2025'!AS61+'Mai-Ago 2025'!AS61+'Set-Dez 2025'!AS61","v":0},{"$nulls":3},0,0,0,null,0,0,0,0,0,{"$f":"'Jan-Abr 2025'!BH61","v":0},{"$f":"'Jan-Abr 2025'!BG61+'Mai-Ago 2025'!BG61+'Set-Dez 2025'!BG61","v":0},{"$nulls":3},0,0,0,null,0,0,0,0,0,{"$f":"'Jan-Abr 2025'!BV61","v":0},{"$f":"'Jan-Abr 2025'!BU61+'Mai-Ago 2025'!BU61+'Set-Dez 2025'!BU61","v":0}]
[{"$nulls":18},"6446","MOT","Métodos e Organização do Trabalho",{"$nulls":6},50,{"$nulls":8},0,0,0,null,0,0,0,0,0,{"$f":"'Jan-Abr 2025'!AT62","v":0},{"$f":"'Jan-Abr 2025'!AS62+'Mai-Ago 2025'!AS62+'Set-Dez 2025'!AS62","v":0},{"$nulls":3},0,0,0,null,0,0,0,0,0,{"$f":"'Jan-Abr 2025'!BH62","v":0},{"$f":"'Jan-Abr 2025'!BG62+'Mai-Ago 2025'!BG62+'Set-Dez 2025'!BG62","v":0},{"$nulls":3},0,0,0,null,0,0,0,0,0,{"$f":"'Jan-Abr 2025'!BV62","v":0},{"$f":"'Jan-Abr 2025'!BU62+'Mai-Ago 2025'!BU62+'Set-Dez 2025'!BU62","v":0}]
[{"$nulls":18},"6447","SGI","Sistema de Gestão Integrada",{"$nulls":6},25,{"$nulls":8},0,0,0,null,0,0,0,0,0,{"$f":"'Jan-Abr 2025'!AT63","v":0},{"$f":"'Jan-Abr 2025'!AS63+'Mai-Ago 2025'!AS63+'Set-Dez 2025'!AS63","v":0},{"$nulls":3},0,0,0,null,{"$f":"COUNTIF($C$10:$AG$18,$AX63)","v":0},{"$f":"COUNTIF($C$22:$AG$30,$AX63)","v":0},{"$f":"COUNTIF($C$34:$AG$42,$AX63)","v":0},{"$f":"COUNTIF($C$46:$AG$54,$AX63)","v":0},0,{"$f":"'Jan-Abr 2025'!BH63","v":0},{"$f":"'Jan-Abr 2025'!BG63+'Mai-Ago 2025'!BG63+'Set-Dez 2025'!BG63","v":0},{"$nulls":3},0,0,0,null,0,0,0,0,0,{"$f":"'Jan-Abr 2025'!BV63","v":0},{"$f":"'Jan-Abr 2025'!BU63+'Mai-Ago 2025'!BU63+'Set-Dez 2025'!BU63","v":0}]
["Tecnológica",6407,"PFL","Processos de Fundição / Ligação",{"$nulls":5},"D333",25,{"$nulls":7},"6448","QCEP","Qualidade - controlo estatístico de processo",{"$nulls":6},50,{"$nulls":8},0,0,0,null,0,0,0,0,0,{"$f":"'Jan-Abr 2025'!AT64","v":0},{"$f":"'Jan-Abr 2025'!AS64+'Mai-Ago 2025'!AS64+'Set-Dez 2025'!AS64","v":0},{"$nulls":3},0,0,0,null,0,0,0,0,0,{"$f":"'Jan-Abr 2025'!BH64","v":0},{"$f":"'Jan-Abr 2025'!BG64+'Mai-Ago 2025'!BG64+'Set-Dez 2025'!BG64","v":0},{"$nulls":3},0,0,0,null,0,0,0,0,0,{"$f":"'Jan-Abr 2025'!BV64","v":0},{"$f":"'Jan-Abr 2025'!BU64+'Mai-Ago 2025'!BU64+'Set-Dez 2025'!BU64","v":0}]
[null,6408,"PCC","Processos de Conformação / Corte",{"$nulls":5},"D334",25,{"$nulls":25},0,0,0,null,0,0,0,0,0,{"$f":"'Jan-Abr 2025'!AT65","v":0},{"$f":"'Jan-Abr 2025'!AS65+'Mai-Ago 2025'!AS65+'Set-Dez 2025'!AS65","v":0},{"$nulls":3},0,0,0,null,0,0,0,0,0,{"$f":"'Jan-Abr 2025'!BH65","v":0},{"$f":"'Jan-Abr 2025'!BG65+'Mai-Ago 2025'!BG65+'Set-Dez 2025'!BG65","v":0},{"$nulls":3},0,0,0,null,0,0,0,{"$f":"COUNTIF($C$46:$AG$54,$BL65)","v":0},0,{"$f":"'Jan-Abr 2025'!BV65","v":0},{"$f":"'Jan-Abr 2025'!BU65+'Mai-Ago 2025'!BU65+'Set-Dez 2025'!BU65","v":0}]
[null,6409,"PAA","Processos por Arranque de Apara",{"$nulls":5},"C588",25,{"$nulls":25},0,0,0,null,0,0,0,0,0,{"$f":"'Jan-Abr 2025'!AT66","v":0},{"$f":"'Jan-Abr 2025'!AS66+'Mai-Ago 2025'!AS66+'Set-Dez 2025'!AS66","v":0},{"$nulls":3},0,0,0,null,0,0,0,0,0,{"$f":"'Jan-Abr 2025'!BH66","v":0},{"$f":"'Jan-Abr 2025'!BG66+'Mai-Ago 2025'!BG66+'Set-Dez 2025'!BG66","v":0},{"$nulls":3},0,0,0,null,0,0,0,0,0,{"$f":"'Jan-Abr 2025'!BV66","v":0},{"$f":"'Jan-Abr 2025'!BU66+'Mai-Ago 2025'!BU66+'Set-Dez 2025'!BU66","v":0}]
[null,6410,"IME","Instalação de Máquinas Elétricas",{"$nulls":5},"K252",50,{"$nulls":25},0,0,0,null,0,0,0,0,0,{"$f":"'Jan-Abr 2025'!AT67","v":0},{"$f":"'Jan-Abr 2025'!AS67+'Mai-Ago 2025'!AS67+'Set-Dez 2025'!AS67","v":0},{"$nulls":3},0,0,0,null,0,0,0,0,0,{"$f":"'Jan-Abr 2025'!BH67","v":0},{"$f":"'Jan-Abr 2025'!BG67+'Mai-Ago 2025'!BG67+'Set-Dez 2025'!BG67","v":0},{"$nulls":3},0,0,0,null,0,0,0,0,0,{"$f":"'Jan-Abr 2025'!BV67","v":0},{"$f":"'Jan-Abr 2025'!BU67+'Mai-Ago 2025'!BU67+'Set-Dez 2025'!BU67","v":0}]
[null,6411,"ELE","Eletrónica",{"$nulls":5},"K253",50,{"$nulls":25},0,0,0,null,0,0,0,0,0,{"$f":"'Jan-Abr 2025'!AT68","v":0},{"$f":"'Jan-Abr 2025'!AS68+'Mai-Ago 2025'!AS68+'Set-Dez 2025'!AS68","v":0},{"$nulls":3},0,0,0,null,0,0,0,0,0,{"$f":"'Jan-Abr 2025'!BH68","v":0},{"$f":"'Jan-Abr 2025'!BG68+'Mai-Ago 2025'!BG68+'Set-Dez 2025'!BG68","v":0},{"$nulls":3},0,0,0,null,0,0,0,0,0,{"$f":"'Jan-Abr 2025'!BV68","v":0},{"$f":"'Jan-Abr 2025'!BU68+'Mai-Ago 2025'!BU68+'Set-Dez 2025'!BU68","v":0}]
[null,6412,"CP","Circuitos Pneumáticos",{"$nulls":5},"E329",25,{"$nulls":25},0,0,0,null,0,0,0,0,0,{"$f":"'Jan-Abr 2025'!AT69","v":0},{"$f":"'Jan-Abr 2025'!AS69+'Mai-Ago 2025'!AS69+'Set-Dez 2025'!AS69","v":0},{"$nulls":3},0,0,0,null,0,0,0,0,0,{"$f":"'Jan-Abr 2025'!BH69","v":0},{"$f":"'Jan-Abr 2025'!BG69+'Mai-Ago 2025'!BG69+'Set-Dez 2025'!BG69","v":0},{"$nulls":3},0,0,0,null,0,0,0,0,0,{"$f":"'Jan-Abr 2025'!BV69","v":0},{"$f":"'Jan-Abr 2025'!BU69+'Mai-Ago 2025'!BU69+'Set-Dez 2025'!BU69","v":0}]
[null,6413,"CH","Circuitos Óleo-Hidráulicos",{"$nulls":5},"E330",25,{"$nulls":6},"Estágio",null,"PCT","Prática em Contexto Trabalho",{"$nulls":5},"E368",560,{"$nulls":8},0,0,0,null,0,0,0,0,0,{"$f":"'Jan-Abr 2025'!AT70","v":0},{"$f":"'Jan-Abr 2025'!AS70+'Mai-Ago 2025'!AS70+'Set-Dez 2025'!AS70","v":0},{"$nulls":3},0,0,0,null,0,0,0,0,0,{"$f":"'Jan-Abr 2025'!BH70","v":0},{"$f":"'Jan-Abr 2025'!BG70+'Mai-Ago 2025'!BG70+'Set-Dez 2025'!BG70","v":0},{"$nulls":3},0,0,0,null,0,0,0,0,0,{"$f":"'Jan-Abr 2025'!BV70","v":0},{"$f":"'Jan-Abr 2025'!BU70+'Mai-Ago 2025'!BU70+'Set-Dez 2025'!BU70","v":0}]
[null,6414,"CLP","Controladores Lógicos Programáveis",{"$nulls":5},"C589",50,{"$nulls":25},0,0,0,null,0,0,0,0,0,{"$f":"'Jan-Abr 2025'!AT71","v":0},{"$f":"'Jan-Abr 2025'!AS71+'Mai-Ago 2025'!AS71+'Set-Dez 2025'!AS71","v":0},{"$nulls":3},0,0,0,null,0,0,0,0,0,{"$f":"'Jan-Abr 2025'!BH71","v":0},{"$f":"'Jan-Abr 2025'!BG71+'Mai-Ago 2025'!BG71+'Set-Dez 2025'!BG71","v":0},{"$nulls":3},0,0,0,null,0,0,0,0,0,{"$f":"'Jan-Abr 2025'!BV71","v":0},{"$f":"'Jan-Abr 2025'!BU71+'Mai-Ago 2025'!BU71+'Set-Dez 2025'!BU71","v":0}]
[null,6415,"DCM","Desenho de Construções Mecânicas",{"$nulls":5},"A438",50,{"$nulls":25},{"$f":"IF(AI72=$DC$8,AM72,IF(AI72=$DC$9,AM72,IF(AI72=$DC$10,AL72,)))","v":0},0,{"$f":"IF(AI72=$DC$8,AL72,IF(AI72=$DC$9,AM73+AL72,IF(AI72=$DC$10,IF(AI73=$DC$10,AM73+AL72,AL72),)))","v":0},null,0,0,0,0,{"$f":"SUM(AO72:AR72)","v":0},{"$f":"'Jan-Abr 2025'!AT72","v":0},{"$f":"'Jan-Abr 2025'!AS72+'Mai-Ago 2025'!AS72+'Set-Dez 2025'!AS72","v":0},{"$nulls":3},{"$f":"IF(AW72=$DC$8,BA72,IF(AW72=$DC$9,BA72,IF(AW72=$DC$10,AZ72,)))","v":0},0,{"$f":"IF(AW72=$DC$8,AZ72,IF(AW72=$DC$9,BA73+AZ72,IF(AW72=$DC$10,IF(AW73=$DC$10,BA73+AZ72,AZ72),)))","v":0},null,0,0,0,0,0,{"$f":"'Jan-Abr 2025'!BH72","v":0},{"$f":"'Jan-Abr 2025'!BG72+'Mai-Ago 2025'!BG72+'Set-Dez 2025'!BG72","v":0},{"$nulls":3},{"$f":"IF(BK72=$DC$8,BO72,IF(BK72=$DC$9,BO72,IF(BK72=$DC$10,BN72,)))","v":0},0,{"$f":"IF(BK72=$DC$8,BN72,IF(BK72=$DC$9,BO73+BN72,IF(BK72=$DC$10,IF(BK73=$DC$10,BO73+BN72,BN72),)))","v":0},null,0,0,0,0,{"$f":"SUM(BQ72:BT72)","v":0},{"$f":"'Jan-Abr 2025'!BV72","v":0},{"$f":"'Jan-Abr 2025'!BU72+'Mai-Ago 2025'!BU72+'Set-Dez 2025'!BU72","v":0}]
[null,6416,"CM","Ciência dos Materiais",{"$nulls":5},"C590",50,{"$nulls":25},0,{"$f":"IF($AK$4=$DB$8,AS73,IF($AK$4=$DB$9,AT73,IF($AK$4=$DB$10,AU73,IF($AK$4=$DB$11,AO73,IF($AK$4=$DB$12,AP73,IF($AK$4=$DB$13,AQ73,IF($AK$4=$DB$14,AR73,\"\")))))))","v":0},0,null,{"$f":"COUNTIF($C$10:$AG$18,$AJ73)","v":0},{"$f":"COUNTIF($C$22:$AG$30,$AJ73)","v":0},{"$f":"COUNTIF($C$34:$AG$42,$AJ73)","v":0},{"$f":"COUNTIF($C$46:$AG$54,$AJ73)","v":0},0,{"$f":"'Jan-Abr 2025'!AT73","v":0},{"$f":"'Jan-Abr 2025'!AS73+'Mai-Ago 2025'!AS73+'Set-Dez 2025'!AS73","v":0},{"$nulls":3},0,{"$f":"IF($AK$4=$DB$8,BG73,IF($AK$4=$DB$9,BH73,IF($AK$4=$DB$10,BI73,IF($AK$4=$DB$11,BC73,IF($AK$4=$DB$12,BD73,IF($AK$4=$DB$13,BE73,IF($AK$4=$DB$14,BF73,\"\")))))))","v":0},0,null,{"$f":"COUNTIF($C$10:$AG$18,$AX73)","v":0},{"$f":"COUNTIF($C$22:$AG$30,$AX73)","v":0},{"$f":"COUNTIF($C$34:$AG$42,$AX73)","v":0},{"$f":"COUNTIF($C$46:$AG$54,$AX73)","v":0},{"$f":"SUM(BC73:BF73)","v":0},{"$f":"'Jan-Abr 2025'!BH73","v":0},{"$f":"'Jan-Abr 2025'!BG73+'Mai-Ago 2025'!BG73+'Set-Dez 2025'!BG73","v":0},{"$nulls":3},0,{"$f":"IF($AK$4=$DB$8,BU73,IF($AK$4=$DB$9,BV73,IF($AK$4=$DB$10,BW73,IF($AK$4=$DB$11,BQ73,IF($AK$4=$DB$12,BR73,IF($AK$4=$DB$13,BS73,IF($AK$4=$DB$14,BT73,\"\")))))))","v":0},0,null,{"$f":"COUNTIF($C$10:$AG$18,$BL73)","v":0},{"$f":"COUNTIF($C$22:$AG$30,$BL73)","v":0},{"$f":"COUNTIF($C$34:$AG$42,$BL73)","v":0},{"$f":"COUNTIF($C$46:$AG$54,$BL73)","v":0},0,{"$f":"'Jan-Abr 2025'!BV73","v":0},{"$f":"'Jan-Abr 2025'!BU73+'Mai-Ago 2025'!BU73+'Set-Dez 2025'!BU73","v":0}]
[null,6417,"SD","Sistemas Digitais",{"$nulls":5},"I159",50,{"$nulls":9},"Seg.","Ter.","Qua.","Qui.","Sex."]
[{"$nulls":19},"Salas:",{"$nulls":16},{"$f":"SUMIF(AI8:AI73,\"=M\",AK8:AK73)+SUMIF(AI8:AI73,\"=T\",AK8:AK73)","v":0},null,null,{"$f":"SUMIF(AI8:AI73,\"=M\",AN8:AN73)+SUMIF(AI8:AI73,\"=T\",AN8:AN73)","v":0},{"$nulls":10},{"$f":"SUMIF(AW8:AW73,\"=M\",AY8:AY73)+SUMIF(AW8:AW73,\"=T\",AY8:AY73)","v":0},null,null,{"$f":"SUMIF(AW8:AW73,\"=M\",BB8:BB73)+SUMIF(AW8:AW73,\"=T\",BB8:BB73)","v":0},{"$nulls":10},{"$f":"SUMIF(BK8:BK73,\"=M\",BM8:BM73)+SUMIF(BK8:BK73,\"=T\",BM8:BM73)","v":0},null,null,{"$f":"SUMIF(BK8:BK73,\"=M\",BP8:BP73)+SUMIF(BK8:BK73,\"=T\",BP8:BP73)","v":0}]
[{"$nulls":34},"Totais",null,{"$f":"AK75+AY75+BM75","v":0},null,null,{"$f":"AN75+BB75+BP75","v":0}]
["R. Quantitativas:"]

{"sheet":"Jan-Abr 2026","index":4,"n_rows":77,"n_cols":107,"rows_kept":77,"merged":[[0,25,0,32],[0,34,2,39],[0,40,6,40],[0,41,6,41],[0,42,6,42],[0,43,6,43],[0,44,6,44],[0,45,6,45],[0,46,6,46],[0,48,2,53],[0,54,6,54],[0,55,6,55],[0,56,6,56],[0,57,6,57],[0,58,6,58],[0,59,6,59],[0,60,6,60],[0,62,2,67],[0,68,6,68],[0,69,6,69],[0,70,6,70],[0,71,6,71],[0,72,6,72],[0,73,6,73],[0,74,6,74],[0,105,6,105],[0,106,6,106],[1,25,1,32],[2,25,2,32],[3,25,3,32],[3,34,6,34],[3,35,6,35],[3,36,6,36],[3,37,6,37],[3,38,6,38],[3,39,6,39],[3,48,6,48],[3,49,6,49],[3,50,6,50],[3,51,6,51],[3,52,6,52],[3,53,6,53],[3,62,6,62],[3,63,6,63],[3,64,6,64],[3,65,6,65],[3,66,6,66],[3,67,6,67],[4,0,4,2],[4,3,4,9],[4,10,4,13],[4,14,4,21],[4,22,4,26],[4,27,4,29],[4,30,4,32],[5,0,5,2],[5,3,5,9],[5,10,5,13],[5,14,5,21],[5,22,5,26],[5,27,5,29],[5,30,5,32],[6,0,6,2],[6,3,6,9],[6,10,6,13],[6,14,6,21],[6,22,6,26],[6,27,6,29],[6,30,6,32],[7,0,8,1],[9,0,9,1],[10,0,10,1],[11,0,11,1],[12,0,12,1],[14,0,14,1],[15,0,15,1],[16,0,16,1],[17,0,17,1],[19,0,20,1],[21,0,21,1],[22,0,22,1],[23,0,23,1],[24,0,24,1],[25,0,25,1],[26,0,26,1],[27,0,27,1],[28,0,28,1],[29,0,29,1],[31,0,32,1],[33,0,33,1],[34,0,34,1],[35,0,35,1],[36,0,36,1],[37,0,37,1],[38,0,38,1],[39,0,39,1],[40,0,40,1],[41,0,41,1],[43,0,44,1],[45,0,45,1],[46,0,46,1],[47,0,47,1],[48,0,48,1],[49,0,49,1],[50,0,50,1],[51,0,51,1],[52,0,52,1],[53,0,53,1],[54,2,54,8],[54,11,54,13],[54,17,54,19],[54,20,54,25],[54,28,54,30],[55,0,60,0],[55,3,55,8],[55,11,55,13],[55,17,63,17],[55,20,55,25],[55,28,55,30],[56,3,56,8],[56,11,56,13],[56,20,56,25],[56,28,56,30],[57,3,57,8],[57,11,57,13],[57,20,57,25],[57,28,57,30],[58,3,58,8],[58,11,58,13],[58,20,58,25],[58,28,58,30],[59,3,59,8],[59,11,59,13],[59,20,59,25],[59,28,59,30],[60,3,60,8],[60,11,60,13],[60,20,60,25],[60,28,60,30],[61,20,61,25],[61,28,61,30],[62,20,62,25],[63,0,73,0],[63,3,63,8],[63,11,63,13],[63,20,63,25],[64,3,64,8],[64,11,64,13],[65,3,65,8],[65,11,65,13],[66,3,66,8],[66,11,66,13],[67,3,67,8],[67,11,67,13],[68,3,68,8],[68,11,68,13],[69,3,69,8],[69,11,69,13],[70,3,70,8],[70,11,70,13],[71,3,71,8],[71,11,71,13],[72,3,72,8],[72,11,72,13],[73,3,73,8],[73,11,73,13],[75,34,75,35],[76,2,76,3],[76,4,76,5],[76,6,76,7],[76,8,76,9],[76,10,76,11],[76,12,76,13]]}
[{"$nulls":40},{"$f":"TEXT($A$8,\"mmm\")","v":"jan"},{"$f":"TEXT($A$20,\"mmm\")","v":"fev"},{"$f":"TEXT($A$32,\"mmm\")","v":"mar"},{"$f":"TEXT($A$44,\"mmm\")","v":"abr"},"Total  Folha","Total Global","Total  Acum.",{"$nulls":7},{"$f":"TEXT($A$8,\"mmm\")","v":"jan"},{"$f":"TEXT($A$20,\"mmm\")","v":"fev"},{"$f":"TEXT($A$32,\"mmm\")","v":"mar"},{"$f":"TEXT($A$44,\"mmm\")","v":"abr"},"Total  Folha","Total Global","Total  Acum.",{"$nulls":7},{"$f":"TEXT($A$8,\"mmm\")","v":"jan"},{"$f":"TEXT($A$20,\"mmm\")","v":"fev"},{"$f":"TEXT($A$32,\"mmm\")","v":"mar"},{"$f":"TEXT($A$44,\"mmm\")","v":"abr"},"Total  Folha","Total Global","Total  Acum.",{"$nulls":30},"tipo_soma","tipo_contador"]
[{"$nulls":25},"Director(a):"]
[{"$nulls":25},"(Cristina Botas)"]
[{"$nulls":34},"Tipo","Módulo","ST","Origem","Cálculo","Objetivo",{"$nulls":8},"Tipo","Módulo",{"$f":"AK4","v":"ST"},"Origem","Cálculo","Objetivo",{"$nulls":8},"Tipo","Módulo",{"$f":"AK4","v":"ST"},"Origem","Cálculo","Objetivo"]
["MODALIDADE:",{"$nulls":9},"CODÍGO DA AÇÃO:",{"$nulls":16},"       U.O.:",null,null,"Torres Vedras"]
["PLANEAMENTO:",{"$nulls":9},"SAÍDA PROFISSIONAL: Técnico/a Especialista em Mecatrónica",{"$nulls":16},"DATA INÍCIO:"]
["COORDENADOR:",{"$nulls":9},"DURAÇÃO:",{"$nulls":16},"DATA FIM  (previsto):"]
["2026-01-01",null,{"$f":"IF(C9<>\"\",CHOOSE(WEEKDAY(C9,1),\"Dom.\",\"Seg.\",\"Ter.\",\"Qua.\",\"Qui.\",\"Sex.\",\"Sáb.\"),\"\")","v":"Qui."},{"$f":"IF(D9<>\"\",CHOOSE(WEEKDAY(D9,1),\"Dom.\",\"Seg.\",\"Ter.\",\"Qua.\",\"Qui.\",\"Sex.\",\"Sáb.\"),\"\")","v":"Sex."},"Sáb.","Dom.","Seg.","Ter.","Qua.","Qui.","Sex.","Sáb.","Dom.","Seg.","Ter.","Qua.","Qui.","Sex.","Sáb.","Dom.","Seg.","Ter.","Qua.","Qui.","Sex.","Sáb.","Dom.","Seg.","Ter.","Qua.","Qui.","Sex.","Sáb.",null,null,"IGO",{"$f":"IF(AI8=$DC$8,AM8,IF(AI8=$DC$9,AM8,IF(AI8=$DC$10,AL8,)))","v":0},{"$f":"IF($AK$4=$DB$8,AS8,IF($AK$4=$DB$9,AT8,IF($AK$4=$DB$10,AU8,IF($AK$4=$DB$11,AO8,IF($AK$4=$DB$12,AP8,IF($AK$4=$DB$13,AQ8,IF($AK$4=$DB$14,AR8,\"\")))))))","v":0},{"$f":"IF(AI8=$DC$8,AL8,IF(AI8=$DC$9,AM9+AL8,IF(AI8=$DC$10,IF(AI9=$DC$10,AM9+AL8,AL8),)))","v":0},25,{"$f":"COUNTIF($C$10:$AG$18,$AJ8)","v":0},{"$f":"COUNTIF($C$22:$AG$30,$AJ8)","v":0},{"$f":"COUNTIF($C$34:$AG$42,$AJ8)","v":0},{"$f":"COUNTIF($C$46:$AG$54,$AJ8)","v":0},{"$f":"SUM(AO8:AR8)","v":0},{"$f":"'Jan-Abr 2025'!AT8","v":0},{"$f":"'Jan-Abr 2025'!AS8+'Mai-Ago 2025'!AS8+'Set-Dez 2025'!AS8+'Jan-Abr 2026'!AS8","v":0},{"$nulls":3},{"$f":"IF(AW8=$DC$8,BA8,IF(AW8=$DC$9,BA8,IF(AW8=$DC$10,AZ8,)))","v":0},{"$f":"IF($AK$4=$DB$8,BG8,IF($AK$4=$DB$9,BH8,IF($AK$4=$DB$10,BI8,IF($AK$4=$DB$11,BC8,IF($AK$4=$DB$12,BD8,IF($AK$4=$DB$13,BE8,IF($AK$4=$DB$14,BF8,\"\")))))))","v":0},{"$f":"IF(AW8=$DC$8,AZ8,IF(AW8=$DC$9,BA9+AZ8,IF(AW8=$DC$10,IF(AW9=$DC$10,BA9+AZ8,AZ8),)))","v":0},null,{"$f":"COUNTIF($C$10:$AG$18,$AX8)","v":0},{"$f":"COUNTIF($C$22:$AG$30,$AX8)","v":0},{"$f":"COUNTIF($C$34:$AG$42,$AX8)","v":0},{"$f":"COUNTIF($C$46:$AG$54,$AX8)","v":0},{"$f":"SUM(BC8:BF8)","v":0},{"$f":"'Jan-Abr 2025'!BH8","v":0},{"$f":"'Jan-Abr 2025'!BG8+'Mai-Ago 2025'!BG8+'Set-Dez 2025'!BG8+'Jan-Abr 2026'!BG8","v":0},{"$nulls":3},{"$f":"IF(BK8=$DC$8,BO8,IF(BK8=$DC$9,BO8,IF(BK8=$DC$10,BN8,)))","v":0},{"$f":"IF($AK$4=$DB$8,BU8,IF($AK$4=$DB$9,BV8,IF($AK$4=$DB$10,BW8,IF($AK$4=$DB$11,BQ8,IF($AK$4=$DB$12,BR8,IF($AK$4=$DB$13,BS8,IF($AK$4=$DB$14,BT8,\"\")))))))","v":0},{"$f":"IF(BK8=$DC$8,BN8,IF(BK8=$DC$9,BO9+BN8,IF(BK8=$DC$10,IF(BK9=$DC$10,BO9+BN8,BN8),)))","v":0},null,{"$f":"COUNTIF($C$10:$AG$18,$BL8)","v":0},{"$f":"COUNTIF($C$22:$AG$30,$BL8)","v":0},{"$f":"COUNTIF($C$34:$AG$42,$BL8)","v":0},{"$f":"COUNTIF($C$46:$AG$54,$BL8)","v":0},{"$f":"SUM(BQ8:BT8)","v":0},{"$f":"'Jan-Abr 2025'!BV8","v":0},{"$f":"'Jan-Abr 2025'!BU8+'Mai-Ago 2025'!BU8+'Set-Dez 2025'!BU8+'Jan-Abr 2026'!BU8","v":0},{"$nulls":30},"SF","M"]
[null,null,{"$f":"A8","v":"2026-01-01"},{"$f":"IF(C9=\"\",\"\",IF(DAY(C9)<DAY(EOMONTH(C9,0)),C9+1,\"\"))","v":"2026-01-02"},{"$f":"IF(D9=\"\",\"\",IF(DAY(D9)<DAY(EOMONTH(D9,0)),D9+1,\"\"))","v":"2026-01-03"},"2026-01-04","2026-01-05","2026-01-06","2026-01-07","2026-01-08",{"$f":"IF(J9=\"\",\"\",IF(DAY(J9)<DAY(EOMONTH(J9,0)),J9+1,\"\"))","v":"2026-01-09"},{"$f":"IF(K9=\"\",\"\",IF(DAY(K9)<DAY(EOMONTH(K9,0)),K9+1,\"\"))","v":"2026-01-10"},"2026-01-11","2026-01-12","2026-01-13","2026-01-14","2026-01-15",{"$f":"IF(Q9=\"\",\"\",IF(DAY(Q9)<DAY(EOMONTH(Q9,0)),Q9+1,\"\"))","v":"2026-01-16"},{"$f":"IF(R9=\"\",\"\",IF(DAY(R9)<DAY(EOMONTH(R9,0)),R9+1,\"\"))","v":"2026-01-17"},"2026-01-18","2026-01-19","2026-01-20","2026-01-21","2026-01-22",{"$f":"IF(X9=\"\",\"\",IF(DAY(X9)<DAY(EOMONTH(X9,0)),X9+1,\"\"))","v":"2026-01-23"},{"$f":"IF(Y9=\"\",\"\",IF(DAY(Y9)<DAY(EOMONTH(Y9,0)),Y9+1,\"\"))","v":"2026-01-24"},"2026-01-25","2026-01-26","2026-01-27","2026-01-28","2026-01-29",{"$f":"IF(AE9=\"\",\"\",IF(DAY(AE9)<DAY(EOMONTH(AE9,0)),AE9+1,\"\"))","v":"2026-01-30"},{"$f":"IF(AF9=\"\",\"\",IF(DAY(AF9)<DAY(EOMONTH(AF9,0)),AF9+1,\"\"))","v":"2026-01-31"},null,null,"GMQ",0,{"$f":"IF($AK$4=$DB$8,AS9,IF($AK$4=$DB$9,AT9,IF($AK$4=$DB$10,AU9,IF($AK$4=$DB$11,AO9,IF($AK$4=$DB$12,AP9,IF($AK$4=$DB$13,AQ9,IF($AK$4=$DB$14,AR9,\"\")))))))","v":0},0,25,{"$f":"COUNTIF($C$10:$AG$18,$AJ9)","v":0},{"$f":"COUNTIF($C$22:$AG$30,$AJ9)","v":0},{"$f":"COUNTIF($C$34:$AG$42,$AJ9)","v":0},{"$f":"COUNTIF($C$46:$AG$54,$AJ9)","v":0},0,{"$f":"'Jan-Abr 2025'!AT9","v":0},{"$f":"'Jan-Abr 2025'!AS9+'Mai-Ago 2025'!AS9+'Set-Dez 2025'!AS9+'Jan-Abr 2026'!AS9","v":0},{"$nulls":3},0,{"$f":"IF($AK$4=$DB$8,BG9,IF($AK$4=$DB$9,BH9,IF($AK$4=$DB$10,BI9,IF($AK$4=$DB$11,BC9,IF($AK$4=$DB$12,BD9,IF($AK$4=$DB$13,BE9,IF($AK$4=$DB$14,BF9,\"\")))))))","v":0},0,null,{"$f":"COUNTIF($C$10:$AG$18,$AX9)","v":0},{"$f":"COUNTIF($C$22:$AG$30,$AX9)","v":0},{"$f":"COUNTIF($C$34:$AG$42,$AX9)","v":0},{"$f":"COUNTIF($C$46:$AG$54,$AX9)","v":0},{"$f":"SUM(BC9:BF9)","v":0},{"$f":"'Jan-Abr 2025'!BH9","v":0},{"$f":"'Jan-Abr 2025'!BG9+'Mai-Ago 2025'!BG9+'Set-Dez 2025'!BG9+'Jan-Abr 2026'!BG9","v":0},{"$nulls":3},0,{"$f":"IF($AK$4=$DB$8,BU9,IF($AK$4=$DB$9,BV9,IF($AK$4=$DB$10,BW9,IF($AK$4=$DB$11,BQ9,IF($AK$4=$DB$12,BR9,IF($AK$4=$DB$13,BS9,IF($AK$4=$DB$14,BT9,\"\")))))))","v":0},0,null,{"$f":"COUNTIF($C$10:$AG$18,$BL9)","v":0},{"$f":"COUNTIF($C$22:$AG$30,$BL9)","v":0},{"$f":"COUNTIF($C$34:$AG$42,$BL9)","v":0},{"$f":"COUNTIF($C$46:$AG$54,$BL9)","v":0},0,{"$f":"'Jan-Abr 2025'!BV9","v":0},{"$f":"'Jan-Abr 2025'!BU9+'Mai-Ago 2025'!BU9+'Set-Dez 2025'!BU9+'Jan-Abr 2026'!BU9","v":0},{"$nulls":30},"ST","T"]
["09h00 - 09h50",{"$nulls":34},"SGQ",0,0,0,25,0,0,0,0,0,{"$f":"'Jan-Abr 2025'!AT10","v":0},{"$f":"'Jan-Abr 2025'!AS10+'Mai-Ago 2025'!AS10+'Set-Dez 2025'!AS10+'Jan-Abr 2026'!AS10","v":0},{"$nulls":3},0,0,0,null,0,0,0,0,0,{"$f":"'Jan-Abr 2025'!BH10","v":0},{"$f":"'Jan-Abr 2025'!BG10+'Mai-Ago 2025'!BG10+'Set-Dez 2025'!BG10+'Jan-Abr 2026'!BG10","v":0},{"$nulls":3},0,0,0,null,0,0,0,0,0,{"$f":"'Jan-Abr 2025'!BV10","v":0},{"$f":"'Jan-Abr 2025'!BU10+'Mai-Ago 2025'!BU10+'Set-Dez 2025'!BU10+'Jan-Abr 2026'!BU10","v":0},{"$nulls":30},"SA","P"]
["09h50 - 10h40",null,"Ano",{"$nulls":32},"ASHST",0,0,0,25,0,0,0,0,0,{"$f":"'Jan-Abr 2025'!AT11","v":0},{"$f":"'Jan-Abr 2025'!AS11+'Mai-Ago 2025'!AS11+'Set-Dez 2025'!AS11+'Jan-Abr 2026'!AS11","v":0},{"$nulls":3},0,0,0,null,0,0,0,0,0,{"$f":"'Jan-Abr 2025'!BH11","v":0},{"$f":"'Jan-Abr 2025'!BG11+'Mai-Ago 2025'!BG11+'Set-Dez 2025'!BG11+'Jan-Abr 2026'!BG11","v":0},{"$nulls":3},0,0,0,null,0,0,0,0,0,{"$f":"'Jan-Abr 2025'!BV11","v":0},{"$f":"'Jan-Abr 2025'!BU11+'Mai-Ago 2025'!BU11+'Set-Dez 2025'!BU11+'Jan-Abr 2026'!BU11","v":0},{"$nulls":30},{"$f":"TEXT(A8,\"mmm\")","v":"jan"}]
["11h00 - 11h50",null,"Novo",{"$nulls":32},"DT",0,0,0,25,0,0,0,0,0,{"$f":"'Jan-Abr 2025'!AT12","v":0},{"$f":"'Jan-Abr 2025'!AS12+'Mai-Ago 2025'!AS12+'Set-Dez 2025'!AS12+'Jan-Abr 2026'!AS12","v":0},{"$nulls":3},0,0,0,null,0,0,0,0,0,{"$f":"'Jan-Abr 2025'!BH12","v":0},{"$f":"'Jan-Abr 2025'!BG12+'Mai-Ago 2025'!BG12+'Set-Dez 2025'!BG12+'Jan-Abr 2026'!BG12","v":0},{"$nulls":3},0,0,0,null,0,0,0,0,0,{"$f":"'Jan-Abr 2025'!BV12","v":0},{"$f":"'Jan-Abr 2025'!BU12+'Mai-Ago 2025'!BU12+'Set-Dez 2025'!BU12+'Jan-Abr 2026'!BU12","v":0},{"$nulls":30},{"$f":"TEXT(A20,\"mmm\")","v":"fev"}]
["11h50 - 12h40",{"$nulls":34},"ICS",0,0,0,25,0,0,0,0,0,{"$f":"'Jan-Abr 2025'!AT13","v":0},{"$f":"'Jan-Abr 2025'!AS13+'Mai-Ago 2025'!AS13+'Set-Dez 2025'!AS13+'Jan-Abr 2026'!AS13","v":0},{"$nulls":3},0,0,0,null,0,0,0,0,0,{"$f":"'Jan-Abr 2025'!BH13","v":0},{"$f":"'Jan-Abr 2025'!BG13+'Mai-Ago 2025'!BG13+'Set-Dez 2025'!BG13+'Jan-Abr 2026'!BG13","v":0},{"$nulls":3},0,0,0,null,0,0,0,0,0,{"$f":"'Jan-Abr 2025'!BV13","v":0},{"$f":"'Jan-Abr 2025'!BU13+'Mai-Ago 2025'!BU13+'Set-Dez 2025'!BU13+'Jan-Abr 2026'!BU13","v":0},{"$nulls":30},{"$f":"TEXT(A32,\"mmm\")","v":"mar"}]
[{"$nulls":36},0,0,0,null,0,0,0,0,0,{"$f":"'Jan-Abr 2025'!AT14","v":0},{"$f":"'Jan-Abr 2025'!AS14+'Mai-Ago 2025'!AS14+'Set-Dez 2025'!AS14+'Jan-Abr 2026'!AS14","v":0},{"$nulls":3},0,0,0,null,0,0,0,0,0,{"$f":"'Jan-Abr 2025'!BH14","v":0},{"$f":"'Jan-Abr 2025'!BG14+'Mai-Ago 2025'!BG14+'Set-Dez 2025'!BG14+'Jan-Abr 2026'!BG14","v":0},{"$nulls":3},0,0,0,null,0,0,0,0,0,{"$f":"'Jan-Abr 2025'!BV14","v":0},{"$f":"'Jan-Abr 2025'!BU14+'Mai-Ago 2025'!BU14+'Set-Dez 2025'!BU14+'Jan-Abr 2026'!BU14","v":0},{"$nulls":30},{"$f":"TEXT(A44,\"mmm\")","v":"abr"}]
["14h00 - 14h50",{"$nulls":34},"PFL",0,0,0,25,0,0,0,0,0,{"$f":"'Jan-Abr 2025'!AT15","v":0},{"$f":"'Jan-Abr 2025'!AS15+'Mai-Ago 2025'!AS15+'Set-Dez 2025'!AS15+'Jan-Abr 2026'!AS15","v":0},{"$nulls":3},0,0,0,null,0,0,0,0,0,{"$f":"'Jan-Abr 2025'!BH15","v":0},{"$f":"'Jan-Abr 2025'!BG15+'Mai-Ago 2025'!BG15+'Set-Dez 2025'!BG15+'Jan-Abr 2026'!BG15","v":0},{"$nulls":3},0,0,0,null,0,0,0,0,0,{"$f":"'Jan-Abr 2025'!BV15","v":0},{"$f":"'Jan-Abr 2025'!BU15+'Mai-Ago 2025'!BU15+'Set-Dez 2025'!BU15+'Jan-Abr 2026'!BU15","v":0}]
["14h50 - 15h40",{"$nulls":34},"PCC",0,0,0,25,0,0,0,0,0,{"$f":"'Jan-Abr 2025'!AT16","v":0},{"$f":"'Jan-Abr 2025'!AS16+'Mai-Ago 2025'!AS16+'Set-Dez 2025'!AS16+'Jan-Abr 2026'!AS16","v":0},{"$nulls":3},0,0,0,null,0,0,0,0,0,{"$f":"'Jan-Abr 2025'!BH16","v":0},{"$f":"'Jan-Abr 2025'!BG16+'Mai-Ago 2025'!BG16+'Set-Dez 2025'!BG16+'Jan-Abr 2026'!BG16","v":0},{"$nulls":3},0,0,0,null,0,0,0,0,0,{"$f":"'Jan-Abr 2025'!BV16","v":0},{"$f":"'Jan-Abr 2025'!BU16+'Mai-Ago 2025'!BU16+'Set-Dez 2025'!BU16+'Jan-Abr 2026'!BU16","v":0}]
["16h00 - 16h50",{"$nulls":34},"PAA",0,0,0,25,0,0,0,0,0,{"$f":"'Jan-Abr 2025'!AT17","v":0},{"$f":"'Jan-Abr 2025'!AS17+'Mai-Ago 2025'!AS17+'Set-Dez 2025'!AS17+'Jan-Abr 2026'!AS17","v":0},{"$nulls":3},0,0,0,null,0,0,0,0,0,{"$f":"'Jan-Abr 2025'!BH17","v":0},{"$f":"'Jan-Abr 2025'!BG17+'Mai-Ago 2025'!BG17+'Set-Dez 2025'!BG17+'Jan-Abr 2026'!BG17","v":0},{"$nulls":3},0,0,0,null,0,0,0,0,0,{"$f":"'Jan-Abr 2025'!BV17","v":0},{"$f":"'Jan-Abr 2025'!BU17+'Mai-Ago 2025'!BU17+'Set-Dez 2025'!BU17+'Jan-Abr 2026'!BU17","v":0}]
["16h50 - 17h40",{"$nulls":34},"IME",0,0,0,50,0,0,0,0,0,{"$f":"'Jan-Abr 2025'!AT18","v":0},{"$f":"'Jan-Abr 2025'!AS18+'Mai-Ago 2025'!AS18+'Set-Dez 2025'!AS18+'Jan-Abr 2026'!AS18","v":0},{"$nulls":3},0,0,0,null,0,0,0,0,0,{"$f":"'Jan-Abr 2025'!BH18","v":0},{"$f":"'Jan-Abr 2025'!BG18+'Mai-Ago 2025'!BG18+'Set-Dez 2025'!BG18+'Jan-Abr 2026'!BG18","v":0},{"$nulls":3},0,0,0,null,0,0,0,0,0,{"$f":"'Jan-Abr 2025'!BV18","v":0},{"$f":"'Jan-Abr 2025'!BU18+'Mai-Ago 2025'!BU18+'Set-Dez 2025'!BU18+'Jan-Abr 2026'!BU18","v":0}]
[{"$nulls":35},"ELE",0,0,0,50,0,0,0,0,0,{"$f":"'Jan-Abr 2025'!AT19","v":0},{"$f":"'Jan-Abr 2025'!AS19+'Mai-Ago 2025'!AS19+'Set-Dez 2025'!AS19+'Jan-Abr 2026'!AS19","v":0},{"$nulls":3},0,0,0,null,0,0,0,0,0,{"$f":"'Jan-Abr 2025'!BH19","v":0},{"$f":"'Jan-Abr 2025'!BG19+'Mai-Ago 2025'!BG19+'Set-Dez 2025'!BG19+'Jan-Abr 2026'!BG19","v":0},{"$nulls":3},0,0,0,null,0,0,0,0,0,{"$f":"'Jan-Abr 2025'!BV19","v":0},{"$f":"'Jan-Abr 2025'!BU19+'Mai-Ago 2025'!BU19+'Set-Dez 2025'!BU19+'Jan-Abr 2026'!BU19","v":0}]
[{"$f":"A8+DAY(EOMONTH(A8,0))","v":"2026-02-01"},null,{"$f":"IF(C21<>\"\",CHOOSE(WEEKDAY(C21,1),\"Dom.\",\"Seg.\",\"Ter.\",\"Qua.\",\"Qui.\",\"Sex.\",\"Sáb.\"),\"\")","v":"Dom."},{"$f":"IF(D21<>\"\",CHOOSE(WEEKDAY(D21,1),\"Dom.\",\"Seg.\",\"Ter.\",\"Qua.\",\"Qui.\",\"Sex.\",\"Sáb.\"),\"\")","v":"Seg."},"Ter.","Qua.","Qui.","Sex.","Sáb.","Dom.","Seg.","Ter.","Qua.","Qui.","Sex.","Sáb.","Dom.","Seg.","Ter.","Qua.","Qui.","Sex.","Sáb.","Dom.","Seg.","Ter.","Qua.","Qui.","Sex.","Sáb.","","","",null,null,"CP",0,0,0,25,0,0,0,0,0,{"$f":"'Jan-Abr 2025'!AT20","v":0},{"$f":"'Jan-Abr 2025'!AS20+'Mai-Ago 2025'!AS20+'Set-Dez 2025'!AS20+'Jan-Abr 2026'!AS20","v":0},{"$nulls":3},0,0,0,null,0,0,0,0,0,{"$f":"'Jan-Abr 2025'!BH20","v":0},{"$f":"'Jan-Abr 2025'!BG20+'Mai-Ago 2025'!BG20+'Set-Dez 2025'!BG20+'Jan-Abr 2026'!BG20","v":0},{"$nulls":3},0,0,0,null,0,0,0,0,0,{"$f":"'Jan-Abr 2025'!BV20","v":0},{"$f":"'Jan-Abr 2025'!BU20+'Mai-Ago 2025'!BU20+'Set-Dez 2025'!BU20+'Jan-Abr 2026'!BU20","v":0}]
[null,null,{"$f":"A20","v":"2026-02-01"},{"$f":"IF(C21=\"\",\"\",IF(DAY(C21)<DAY(EOMONTH(C21,0)),C21+1,\"\"))","v":"2026-02-02"},"2026-02-03","2026-02-04","2026-02-05","2026-02-06","2026-02-07","2026-02-08","2026-02-09","2026-02-10","2026-02-11","2026-02-12","2026-02-13","2026-02-14","2026-02-15","2026-02-16","2026-02-17","2026-02-18","2026-02-19","2026-02-20","2026-02-21","2026-02-22","2026-02-23","2026-02-24","2026-02-25","2026-02-26","2026-02-27","2026-02-28","","","",null,null,"CH",0,0,0,25,0,0,0,0,0,{"$f":"'Jan-Abr 2025'!AT21","v":0},{"$f":"'Jan-Abr 2025'!AS21+'Mai-Ago 2025'!AS21+'Set-Dez 2025'!AS21+'Jan-Abr 2026'!AS21","v":0},{"$nulls":3},0,0,0,null,0,0,0,0,0,{"$f":"'Jan-Abr 2025'!BH21","v":0},{"$f":"'Jan-Abr 2025'!BG21+'Mai-Ago 2025'!BG21+'Set-Dez 2025'!BG21+'Jan-Abr 2026'!BG21","v":0},{"$nulls":3},0,0,0,null,0,0,0,0,0,{"$f":"'Jan-Abr 2025'!BV21","v":0},{"$f":"'Jan-Abr 2025'!BU21+'Mai-Ago 2025'!BU21+'Set-Dez 2025'!BU21+'Jan-Abr 2026'!BU21","v":0}]
[{"$f":"A10","v":"09h00 - 09h50"},{"$nulls":34},"CLP",0,0,0,50,0,0,0,0,0,{"$f":"'Jan-Abr 2025'!AT22","v":0},{"$f":"'Jan-Abr 2025'!AS22+'Mai-Ago 2025'!AS22+'Set-Dez 2025'!AS22+'Jan-Abr 2026'!AS22","v":0},{"$nulls":3},0,0,0,null,0,0,0,0,0,{"$f":"'Jan-Abr 2025'!BH22","v":0},{"$f":"'Jan-Abr 2025'!BG22+'Mai-Ago 2025'!BG22+'Set-Dez 2025'!BG22+'Jan-Abr 2026'!BG22","v":0},{"$nulls":3},0,0,0,null,0,0,0,0,0,{"$f":"'Jan-Abr 2025'!BV22","v":0},{"$f":"'Jan-Abr 2025'!BU22+'Mai-Ago 2025'!BU22+'Set-Dez 2025'!BU22+'Jan-Abr 2026'!BU22","v":0}]
[{"$f":"A11","v":"09h50 - 10h40"},{"$nulls":17},"Entrudo",{"$nulls":16},"DCM",0,0,0,50,0,0,0,0,0,{"$f":"'Jan-Abr 2025'!AT23","v":0},{"$f":"'Jan-Abr 2025'!AS23+'Mai-Ago 2025'!AS23+'Set-Dez 2025'!AS23+'Jan-Abr 2026'!AS23","v":0},{"$nulls":3},0,0,0,null,0,0,0,0,0,{"$f":"'Jan-Abr 2025'!BH23","v":0},{"$f":"'Jan-Abr 2025'!BG23+'Mai-Ago 2025'!BG23+'Set-Dez 2025'!BG23+'Jan-Abr 2026'!BG23","v":0},{"$nulls":3},0,0,0,null,0,0,0,0,0,{"$f":"'Jan-Abr 2025'!BV23","v":0},{"$f":"'Jan-Abr 2025'!BU23+'Mai-Ago 2025'!BU23+'Set-Dez 2025'!BU23+'Jan-Abr 2026'!BU23","v":0}]
["11h00 - 11h50",{"$nulls":34},"CM",0,0,0,50,0,0,0,0,0,{"$f":"'Jan-Abr 2025'!AT24","v":0},{"$f":"'Jan-Abr 2025'!AS24+'Mai-Ago 2025'!AS24+'Set-Dez 2025'!AS24+'Jan-Abr 2026'!AS24","v":0},{"$nulls":3},0,0,0,null,0,0,0,0,0,{"$f":"'Jan-Abr 2025'!BH24","v":0},{"$f":"'Jan-Abr 2025'!BG24+'Mai-Ago 2025'!BG24+'Set-Dez 2025'!BG24+'Jan-Abr 2026'!BG24","v":0},{"$nulls":3},0,0,0,null,0,0,0,0,0,{"$f":"'Jan-Abr 2025'!BV24","v":0},{"$f":"'Jan-Abr 2025'!BU24+'Mai-Ago 2025'!BU24+'Set-Dez 2025'!BU24+'Jan-Abr 2026'!BU24","v":0}]
["11h50 - 12h40",{"$nulls":34},"SD",0,0,0,50,0,0,0,0,0,{"$f":"'Jan-Abr 2025'!AT25","v":0},{"$f":"'Jan-Abr 2025'!AS25+'Mai-Ago 2025'!AS25+'Set-Dez 2025'!AS25+'Jan-Abr 2026'!AS25","v":0},{"$nulls":3},0,0,0,null,0,0,0,0,0,{"$f":"'Jan-Abr 2025'!BH25","v":0},{"$f":"'Jan-Abr 2025'!BG25+'Mai-Ago 2025'!BG25+'Set-Dez 2025'!BG25+'Jan-Abr 2026'!BG25","v":0},{"$nulls":3},0,0,0,null,0,0,0,0,0,{"$f":"'Jan-Abr 2025'!BV25","v":0},{"$f":"'Jan-Abr 2025'!BU25+'Mai-Ago 2025'!BU25+'Set-Dez 2025'!BU25+'Jan-Abr 2026'!BU25","v":0}]
[{"$nulls":35},"OEM",0,0,0,50,0,0,0,0,0,{"$f":"'Jan-Abr 2025'!AT26","v":0},{"$f":"'Jan-Abr 2025'!AS26+'Mai-Ago 2025'!AS26+'Set-Dez 2025'!AS26+'Jan-Abr 2026'!AS26","v":0},{"$nulls":3},0,0,0,null,0,0,0,0,0,{"$f":"'Jan-Abr 2025'!BH26","v":0},{"$f":"'Jan-Abr 2025'!BG26+'Mai-Ago 2025'!BG26+'Set-Dez 2025'!BG26+'Jan-Abr 2026'!BG26","v":0},{"$nulls":3},0,0,0,null,0,0,0,0,0,{"$f":"'Jan-Abr 2025'!BV26","v":0},{"$f":"'Jan-Abr 2025'!BU26+'Mai-Ago 2025'!BU26+'Set-Dez 2025'!BU26+'Jan-Abr 2026'!BU26","v":0}]
["14h00 - 14h50",{"$nulls":34},"GP",0,0,0,50,0,0,0,0,0,{"$f":"'Jan-Abr 2025'!AT27","v":0},{"$f":"'Jan-Abr 2025'!AS27+'Mai-Ago 2025'!AS27+'Set-Dez 2025'!AS27+'Jan-Abr 2026'!AS27","v":0},{"$nulls":3},0,0,0,null,0,0,0,0,0,{"$f":"'Jan-Abr 2025'!BH27","v":0},{"$f":"'Jan-Abr 2025'!BG27+'Mai-Ago 2025'!BG27+'Set-Dez 2025'!BG27+'Jan-Abr 2026'!BG27","v":0},{"$nulls":3},0,0,0,null,0,0,0,0,0,{"$f":"'Jan-Abr 2025'!BV27","v":0},{"$f":"'Jan-Abr 2025'!BU27+'Mai-Ago 2025'!BU27+'Set-Dez 2025'!BU27+'Jan-Abr 2026'!BU27","v":0}]
["14h50 - 15h40",{"$nulls":34},"PP",0,0,0,50,0,0,0,0,0,{"$f":"'Jan-Abr 2025'!AT28","v":0},{"$f":"'Jan-Abr 2025'!AS28+'Mai-Ago 2025'!AS28+'Set-Dez 2025'!AS28+'Jan-Abr 2026'!AS28","v":0},{"$nulls":3},0,0,0,null,0,0,0,0,0,{"$f":"'Jan-Abr 2025'!BH28","v":0},{"$f":"'Jan-Abr 2025'!BG28+'Mai-Ago 2025'!BG28+'Set-Dez 2025'!BG28+'Jan-Abr 2026'!BG28","v":0},{"$nulls":3},0,0,0,null,0,0,0,0,0,{"$f":"'Jan-Abr 2025'!BV28","v":0},{"$f":"'Jan-Abr 2025'!BU28+'Mai-Ago 2025'!BU28+'Set-Dez 2025'!BU28+'Jan-Abr 2026'!BU28","v":0}]
["16h00 - 16h50",{"$nulls":34},"GS",0,0,0,50,0,0,0,0,0,{"$f":"'Jan-Abr 2025'!AT29","v":0},{"$f":"'Jan-Abr 2025'!AS29+'Mai-Ago 2025'!AS29+'Set-Dez 2025'!AS29+'Jan-Abr 2026'!AS29","v":0},{"$nulls":3},0,0,0,null,0,0,0,0,0,{"$f":"'Jan-Abr 2025'!BH29","v":0},{"$f":"'Jan-Abr 2025'!BG29+'Mai-Ago 2025'!BG29+'Set-Dez 2025'!BG29+'Jan-Abr 2026'!BG29","v":0},{"$nulls":3},0,0,0,null,0,0,0,0,0,{"$f":"'Jan-Abr 2025'!BV29","v":0},{"$f":"'Jan-Abr 2025'!BU29+'Mai-Ago 2025'!BU29+'Set-Dez 2025'!BU29+'Jan-Abr 2026'!BU29","v":0}]
["16h50 - 17h40",{"$nulls":34},"CGO",0,0,0,50,0,0,0,0,0,{"$f":"'Jan-Abr 2025'!AT30","v":0},{"$f":"'Jan-Abr 2025'!AS30+'Mai-Ago 2025'!AS30+'Set-Dez 2025'!AS30+'Jan-Abr 2026'!AS30","v":0},{"$nulls":3},0,0,0,null,0,0,0,0,0,{"$f":"'Jan-Abr 2025'!BH30","v":0},{"$f":"'Jan-Abr 2025'!BG30+'Mai-Ago 2025'!BG30+'Set-Dez 2025'!BG30+'Jan-Abr 2026'!BG30","v":0},{"$nulls":3},0,0,0,null,0,0,0,0,0,{"$f":"'Jan-Abr 2025'!BV30","v":0},{"$f":"'Jan-Abr 2025'!BU30+'Mai-Ago 2025'!BU30+'Set-Dez 2025'!BU30+'Jan-Abr 2026'!BU30","v":0}]
[{"$nulls":35},"LOG",0,0,0,50,0,0,0,0,0,{"$f":"'Jan-Abr 2025'!AT31","v":0},{"$f":"'Jan-Abr 2025'!AS31+'Mai-Ago 2025'!AS31+'Set-Dez 2025'!AS31+'Jan-Abr 2026'!AS31","v":0},{"$nulls":3},0,0,0,null,0,0,0,0,0,{"$f":"'Jan-Abr 2025'!BH31","v":0},{"$f":"'Jan-Abr 2025'!BG31+'Mai-Ago 2025'!BG31+'Set-Dez 2025'!BG31+'Jan-Abr 2026'!BG31","v":0},{"$nulls":3},0,0,0,null,0,0,0,0,0,{"$f":"'Jan-Abr 2025'!BV31","v":0},{"$f":"'Jan-Abr 2025'!BU31+'Mai-Ago 2025'!BU31+'Set-Dez 2025'!BU31+'Jan-Abr 2026'!BU31","v":0}]
[{"$f":"A20+DAY(EOMONTH(A20,0))","v":"2026-03-01"},null,{"$f":"IF(C33<>\"\",CHOOSE(WEEKDAY(C33,1),\"Dom.\",\"Seg.\",\"Ter.\",\"Qua.\",\"Qui.\",\"Sex.\",\"Sáb.\"),\"\")","v":"Dom."},{"$f":"IF(D33<>\"\",CHOOSE(WEEKDAY(D33,1),\"Dom.\",\"Seg.\",\"Ter.\",\"Qua.\",\"Qui.\",\"Sex.\",\"Sáb.\"),\"\")","v":"Seg."},"Ter.","Qua.","Qui.","Sex.","Sáb.","Dom.","Seg.","Ter.","Qua.","Qui.","Sex.","Sáb.","Dom.","Seg.","Ter.","Qua.","Qui.","Sex.","Sáb.","Dom.","Seg.","Ter.","Qua.","Qui.","Sex.","Sáb.","Dom.","Seg.","Ter.",null,null,"MOT",0,0,0,50,0,0,0,0,0,{"$f":"'Jan-Abr 2025'!AT32","v":0},{"$f":"'Jan-Abr 2025'!AS32+'Mai-Ago 2025'!AS32+'Set-Dez 2025'!AS32+'Jan-Abr 2026'!AS32","v":0},{"$nulls":3},0,0,0,null,0,0,0,0,0,{"$f":"'Jan-Abr 2025'!BH32","v":0},{"$f":"'Jan-Abr 2025'!BG32+'Mai-Ago 2025'!BG32+'Set-Dez 2025'!BG32+'Jan-Abr 2026'!BG32","v":0},{"$nulls":3},0,0,0,null,0,0,0,0,0,{"$f":"'Jan-Abr 2025'!BV32","v":0},{"$f":"'Jan-Abr 2025'!BU32+'Mai-Ago 2025'!BU32+'Set-Dez 2025'!BU32+'Jan-Abr 2026'!BU32","v":0}]
[null,null,{"$f":"A32","v":"2026-03-01"},{"$f":"IF(C33=\"\",\"\",IF(DAY(C33)<DAY(EOMONTH(C33,0)),C33+1,\"\"))","v":"2026-03-02"},"2026-03-03","2026-03-04","2026-03-05","2026-03-06","2026-03-07","2026-03-08","2026-03-09","2026-03-10","2026-03-11","2026-03-12","2026-03-13","2026-03-14","2026-03-15","2026-03-16","2026-03-17","2026-03-18","2026-03-19","2026-03-20","2026-03-21","2026-03-22","2026-03-23","2026-03-24","2026-03-25","2026-03-26","2026-03-27","2026-03-28","2026-03-29","2026-03-30","2026-03-31",null,null,"SGI",0,0,0,25,0,0,0,0,0,{"$f":"'Jan-Abr 2025'!AT33","v":0},{"$f":"'Jan-Abr 2025'!AS33+'Mai-Ago 2025'!AS33+'Set-Dez 2025'!AS33+'Jan-Abr 2026'!AS33","v":0},{"$nulls":3},0,0,0,null,0,0,0,0,0,{"$f":"'Jan-Abr 2025'!BH33","v":0},{"$f":"'Jan-Abr 2025'!BG33+'Mai-Ago 2025'!BG33+'Set-Dez 2025'!BG33+'Jan-Abr 2026'!BG33","v":0},{"$nulls":3},0,0,0,null,0,0,0,0,0,{"$f":"'Jan-Abr 2025'!BV33","v":0},{"$f":"'Jan-Abr 2025'!BU33+'Mai-Ago 2025'!BU33+'Set-Dez 2025'!BU33+'Jan-Abr 2026'!BU33","v":0}]
[{"$f":"A22","v":"09h00 - 09h50"},{"$nulls":34},"QCEP",0,0,0,50,0,0,0,0,0,{"$f":"'Jan-Abr 2025'!AT34","v":0},{"$f":"'Jan-Abr 2025'!AS34+'Mai-Ago 2025'!AS34+'Set-Dez 2025'!AS34+'Jan-Abr 2026'!AS34","v":0},{"$nulls":3},0,0,0,null,0,0,0,0,0,{"$f":"'Jan-Abr 2025'!BH34","v":0},{"$f":"'Jan-Abr 2025'!BG34+'Mai-Ago 2025'!BG34+'Set-Dez 2025'!BG34+'Jan-Abr 2026'!BG34","v":0},{"$nulls":3},0,0,0,null,0,0,0,0,0,{"$f":"'Jan-Abr 2025'!BV34","v":0},{"$f":"'Jan-Abr 2025'!BU34+'Mai-Ago 2025'!BU34+'Set-Dez 2025'!BU34+'Jan-Abr 2026'!BU34","v":0}]
[{"$f":"A23","v":"09h50 - 10h40"},{"$nulls":35},0,0,0,null,0,0,0,0,0,{"$f":"'Jan-Abr 2025'!AT35","v":0},{"$f":"'Jan-Abr 2025'!AS35+'Mai-Ago 2025'!AS35+'Set-Dez 2025'!AS35+'Jan-Abr 2026'!AS35","v":0},{"$nulls":3},0,0,0,null,0,0,0,0,0,{"$f":"'Jan-Abr 2025'!BH35","v":0},{"$f":"'Jan-Abr 2025'!BG35+'Mai-Ago 2025'!BG35+'Set-Dez 2025'!BG35+'Jan-Abr 2026'!BG35","v":0},{"$nulls":3},0,0,0,null,0,0,0,0,0,{"$f":"'Jan-Abr 2025'!BV35","v":0},{"$f":"'Jan-Abr 2025'!BU35+'Mai-Ago 2025'!BU35+'Set-Dez 2025'!BU35+'Jan-Abr 2026'!BU35","v":0}]
["11h00 - 11h50",{"$nulls":35},0,0,0,null,0,0,0,0,0,{"$f":"'Jan-Abr 2025'!AT36","v":0},{"$f":"'Jan-Abr 2025'!AS36+'Mai-Ago 2025'!AS36+'Set-Dez 2025'!AS36+'Jan-Abr 2026'!AS36","v":0},{"$nulls":3},0,0,0,null,0,0,0,0,0,{"$f":"'Jan-Abr 2025'!BH36","v":0},{"$f":"'Jan-Abr 2025'!BG36+'Mai-Ago 2025'!BG36+'Set-Dez 2025'!BG36+'Jan-Abr 2026'!BG36","v":0},{"$nulls":3},0,0,0,null,0,0,0,0,0,{"$f":"'Jan-Abr 2025'!BV36","v":0},{"$f":"'Jan-Abr 2025'!BU36+'Mai-Ago 2025'!BU36+'Set-Dez 2025'!BU36+'Jan-Abr 2026'!BU36","v":0}]
["11h50 - 12h40",{"$nulls":35},0,0,0,null,0,0,0,0,0,{"$f":"'Jan-Abr 2025'!AT37","v":0},{"$f":"'Jan-Abr 2025'!AS37+'Mai-Ago 2025'!AS37+'Set-Dez 2025'!AS37+'Jan-Abr 2026'!AS37","v":0},{"$nulls":3},0,0,0,null,0,0,0,0,0,{"$f":"'Jan-Abr 2025'!BH37","v":0},{"$f":"'Jan-Abr 2025'!BG37+'Mai-Ago 2025'!BG37+'Set-Dez 2025'!BG37+'Jan-Abr 2026'!BG37","v":0},{"$nulls":3},0,0,0,null,0,0,0,0,0,{"$f":"'Jan-Abr 2025'!BV37","v":0},{"$f":"'Jan-Abr 2025'!BU37+'Mai-Ago 2025'!BU37+'Set-Dez 2025'!BU37+'Jan-Abr 2026'!BU37","v":0}]
[{"$nulls":36},0,0,0,null,0,0,0,0,0,{"$f":"'Jan-Abr 2025'!AT38","v":0},{"$f":"'Jan-Abr 2025'!AS38+'Mai-Ago 2025'!AS38+'Set-Dez 2025'!AS38+'Jan-Abr 2026'!AS38","v":0},{"$nulls":3},0,0,0,null,0,0,0,0,0,{"$f":"'Jan-Abr 2025'!BH38","v":0},{"$f":"'Jan-Abr 2025'!BG38+'Mai-Ago 2025'!BG38+'Set-Dez 2025'!BG38+'Jan-Abr 2026'!BG38","v":0},{"$nulls":3},0,0,0,null,0,0,0,0,0,{"$f":"'Jan-Abr 2025'!BV38","v":0},{"$f":"'Jan-Abr 2025'!BU38+'Mai-Ago 2025'!BU38+'Set-Dez 2025'!BU38+'Jan-Abr 2026'!BU38","v":0}]
["14h00 - 14h50",{"$nulls":35},0,0,0,null,0,0,0,0,0,{"$f":"'Jan-Abr 2025'!AT39","v":0},{"$f":"'Jan-Abr 2025'!AS39+'Mai-Ago 2025'!AS39+'Set-Dez 2025'!AS39+'Jan-Abr 2026'!AS39","v":0},{"$nulls":3},0,0,0,null,0,0,0,0,0,{"$f":"'Jan-Abr 2025'!BH39","v":0},{"$f":"'Jan-Abr 2025'!BG39+'Mai-Ago 2025'!BG39+'Set-Dez 2025'!BG39+'Jan-Abr 2026'!BG39","v":0},{"$nulls":3},0,0,0,null,0,0,0,0,0,{"$f":"'Jan-Abr 2025'!BV39","v":0},{"$f":"'Jan-Abr 2025'!BU39+'Mai-Ago 2025'!BU39+'Set-Dez 2025'!BU39+'Jan-Abr 2026'!BU39","v":0}]
["14h50 - 15h40",{"$nulls":35},0,0,0,null,0,0,0,0,{"$f":"SUM(AO40:AR40)","v":0},{"$f":"'Jan-Abr 2025'!AT40","v":0},{"$f":"'Jan-Abr 2025'!AS40+'Mai-Ago 2025'!AS40+'Set-Dez 2025'!AS40+'Jan-Abr 2026'!AS40","v":0},{"$nulls":3},0,0,0,null,0,0,0,0,0,{"$f":"'Jan-Abr 2025'!BH40","v":0},{"$f":"'Jan-Abr 2025'!BG40+'Mai-Ago 2025'!BG40+'Set-Dez 2025'!BG40+'Jan-Abr 2026'!BG40","v":0},{"$nulls":3},0,0,0,null,0,0,0,0,{"$f":"SUM(BQ40:BT40)","v":0},{"$f":"'Jan-Abr 2025'!BV40","v":0},{"$f":"'Jan-Abr 2025'!BU40+'Mai-Ago 2025'!BU40+'Set-Dez 2025'!BU40+'Jan-Abr 2026'!BU40","v":0}]
["16h00 - 16h50",{"$nulls":35},0,0,0,null,0,0,0,0,0,{"$f":"'Jan-Abr 2025'!AT41","v":0},{"$f":"'Jan-Abr 2025'!AS41+'Mai-Ago 2025'!AS41+'Set-Dez 2025'!AS41+'Jan-Abr 2026'!AS41","v":0},{"$nulls":3},0,0,0,null,0,0,0,0,0,{"$f":"'Jan-Abr 2025'!BH41","v":0},{"$f":"'Jan-Abr 2025'!BG41+'Mai-Ago 2025'!BG41+'Set-Dez 2025'!BG41+'Jan-Abr 2026'!BG41","v":0},{"$nulls":3},0,0,0,null,0,0,0,0,0,{"$f":"'Jan-Abr 2025'!BV41","v":0},{"$f":"'Jan-Abr 2025'!BU41+'Mai-Ago 2025'!BU41+'Set-Dez 2025'!BU41+'Jan-Abr 2026'!BU41","v":0}]
["16h50 - 17h40",{"$nulls":35},0,0,0,null,0,0,0,0,0,{"$f":"'Jan-Abr 2025'!AT42","v":0},{"$f":"'Jan-Abr 2025'!AS42+'Mai-Ago 2025'!AS42+'Set-Dez 2025'!AS42+'Jan-Abr 2026'!AS42","v":0},{"$nulls":3},0,0,0,null,0,0,0,0,0,{"$f":"'Jan-Abr 2025'!BH42","v":0},{"$f":"'Jan-Abr 2025'!BG42+'Mai-Ago 2025'!BG42+'Set-Dez 2025'!BG42+'Jan-Abr 2026'!BG42","v":0},{"$nulls":3},0,0,0,null,0,0,0,0,0,{"$f":"'Jan-Abr 2025'!BV42","v":0},{"$f":"'Jan-Abr 2025'!BU42+'Mai-Ago 2025'!BU42+'Set-Dez 2025'!BU42+'Jan-Abr 2026'!BU42","v":0}]
[{"$nulls":36},0,0,0,null,0,0,0,0,0,{"$f":"'Jan-Abr 2025'!AT43","v":0},{"$f":"'Jan-Abr 2025'!AS43+'Mai-Ago 2025'!AS43+'Set-Dez 2025'!AS43+'Jan-Abr 2026'!AS43","v":0},{"$nulls":3},0,0,0,null,0,0,0,0,0,{"$f":"'Jan-Abr 2025'!BH43","v":0},{"$f":"'Jan-Abr 2025'!BG43+'Mai-Ago 2025'!BG43+'Set-Dez 2025'!BG43+'Jan-Abr 2026'!BG43","v":0},{"$nulls":3},0,0,0,null,0,0,0,0,0,{"$f":"'Jan-Abr 2025'!BV43","v":0},{"$f":"'Jan-Abr 2025'!BU43+'Mai-Ago 2025'!BU43+'Set-Dez 2025'!BU43+'Jan-Abr 2026'!BU43","v":0}]
[{"$f":"A32+DAY(EOMONTH(A32,0))","v":"2026-04-01"},null,{"$f":"IF(C45<>\"\",CHOOSE(WEEKDAY(C45,1),\"Dom.\",\"Seg.\",\"Ter.\",\"Qua.\",\"Qui.\",\"Sex.\",\"Sáb.\"),\"\")","v":"Qua."},{"$f":"IF(D45<>\"\",CHOOSE(WEEKDAY(D45,1),\"Dom.\",\"Seg.\",\"Ter.\",\"Qua.\",\"Qui.\",\"Sex.\",\"Sáb.\"),\"\")","v":"Qui."},"Sex.","Sáb.","Dom.","Seg.","Ter.","Qua.","Qui.","Sex.","Sáb.","Dom.","Seg.","Ter.","Qua.","Qui.","Sex.","Sáb.","Dom.","Seg.","Ter.","Qua.","Qui.","Sex.","Sáb.","Dom.","Seg.","Ter.","Qua.","Qui.","",{"$nulls":3},0,0,0,null,0,0,0,0,0,{"$f":"'Jan-Abr 2025'!AT44","v":0},{"$f":"'Jan-Abr 2025'!AS44+'Mai-Ago 2025'!AS44+'Set-Dez 2025'!AS44+'Jan-Abr 2026'!AS44","v":0},{"$nulls":3},0,0,0,null,0,0,0,0,0,{"$f":"'Jan-Abr 2025'!BH44","v":0},{"$f":"'Jan-Abr 2025'!BG44+'Mai-Ago 2025'!BG44+'Set-Dez 2025'!BG44+'Jan-Abr 2026'!BG44","v":0},{"$nulls":3},0,0,0,null,0,0,0,0,0,{"$f":"'Jan-Abr 2025'!BV44","v":0},{"$f":"'Jan-Abr 2025'!BU44+'Mai-Ago 2025'!BU44+'Set-Dez 2025'!BU44+'Jan-Abr 2026'!BU44","v":0}]
[null,null,{"$f":"A44","v":"2026-04-01"},{"$f":"IF(C45=\"\",\"\",IF(DAY(C45)<DAY(EOMONTH(C45,0)),C45+1,\"\"))","v":"2026-04-02"},"2026-04-03","2026-04-04","2026-04-05","2026-04-06","2026-04-07","2026-04-08","2026-04-09","2026-04-10","2026-04-11","2026-04-12","2026-04-13","2026-04-14","2026-04-15","2026-04-16","2026-04-17","2026-04-18","2026-04-19","2026-04-20","2026-04-21","2026-04-22","2026-04-23","2026-04-24","2026-04-25","2026-04-26","2026-04-27","2026-04-28","2026-04-29","2026-04-30","",{"$nulls":3},0,0,0,null,0,0,0,0,0,{"$f":"'Jan-Abr 2025'!AT45","v":0},{"$f":"'Jan-Abr 2025'!AS45+'Mai-Ago 2025'!AS45+'Set-Dez 2025'!AS45+'Jan-Abr 2026'!AS45","v":0},{"$nulls":3},0,0,0,null,0,0,0,0,0,{"$f":"'Jan-Abr 2025'!BH45","v":0},{"$f":"'Jan-Abr 2025'!BG45+'Mai-Ago 2025'!BG45+'Set-Dez 2025'!BG45+'Jan-Abr 2026'!BG45","v":0},{"$nulls":3},0,0,0,null,0,0,0,0,0,{"$f":"'Jan-Abr 2025'!BV45","v":0},{"$f":"'Jan-Abr 2025'!BU45+'Mai-Ago 2025'!BU45+'Set-Dez 2025'!BU45+'Jan-Abr 2026'!BU45","v":0}]
[{"$f":"A10","v":"09h00 - 09h50"},{"$nulls":3},"Sexta",{"$nulls":31},0,0,0,null,0,0,0,0,0,{"$f":"'Jan-Abr 2025'!AT46","v":0},{"$f":"'Jan-Abr 2025'!AS46+'Mai-Ago 2025'!AS46+'Set-Dez 2025'!AS46+'Jan-Abr 2026'!AS46","v":0},{"$nulls":3},0,0,0,null,0,0,0,0,0,{"$f":"'Jan-Abr 2025'!BH46","v":0},{"$f":"'Jan-Abr 2025'!BG46+'Mai-Ago 2025'!BG46+'Set-Dez 2025'!BG46+'Jan-Abr 2026'!BG46","v":0},{"$nulls":3},0,0,0,null,0,0,0,0,0,{"$f":"'Jan-Abr 2025'!BV46","v":0},{"$f":"'Jan-Abr 2025'!BU46+'Mai-Ago 2025'!BU46+'Set-Dez 2025'!BU46+'Jan-Abr 2026'!BU46","v":0}]
[{"$f":"A11","v":"09h50 - 10h40"},{"$nulls":3},"Feira",null,"Pascoa",{"$nulls":19},"Liberd.",{"$nulls":9},0,0,0,null,0,0,0,0,0,{"$f":"'Jan-Abr 2025'!AT47","v":0},{"$f":"'Jan-Abr 2025'!AS47+'Mai-Ago 2025'!AS47+'Set-Dez 2025'!AS47+'Jan-Abr 2026'!AS47","v":0},{"$nulls":3},0,0,0,null,0,0,0,0,0,{"$f":"'Jan-Abr 2025'!BH47","v":0},{"$f":"'Jan-Abr 2025'!BG47+'Mai-Ago 2025'!BG47+'Set-Dez 2025'!BG47+'Jan-Abr 2026'!BG47","v":0},{"$nulls":3},0,0,0,null,0,0,0,0,0,{"$f":"'Jan-Abr 2025'!BV47","v":0},{"$f":"'Jan-Abr 2025'!BU47+'Mai-Ago 2025'!BU47+'Set-Dez 2025'!BU47+'Jan-Abr 2026'!BU47","v":0}]
["11h00 - 11h50",{"$nulls":3},"Santa",{"$nulls":31},0,0,0,null,0,0,0,0,0,{"$f":"'Jan-Abr 2025'!AT48","v":0},{"$f":"'Jan-Abr 2025'!AS48+'Mai-Ago 2025'!AS48+'Set-Dez 2025'!AS48+'Jan-Abr 2026'!AS48","v":0},{"$nulls":3},0,0,0,null,0,0,0,0,0,{"$f":"'Jan-Abr 2025'!BH48","v":0},{"$f":"'Jan-Abr 2025'!BG48+'Mai-Ago 2025'!BG48+'Set-Dez 2025'!BG48+'Jan-Abr 2026'!BG48","v":0},{"$nulls":3},0,0,0,null,0,0,0,0,0,{"$f":"'Jan-Abr 2025'!BV48","v":0},{"$f":"'Jan-Abr 2025'!BU48+'Mai-Ago 2025'!BU48+'Set-Dez 2025'!BU48+'Jan-Abr 2026'!BU48","v":0}]
["11h50 - 12h40",{"$nulls":35},0,0,0,null,0,0,0,0,0,{"$f":"'Jan-Abr 2025'!AT49","v":0},{"$f":"'Jan-Abr 2025'!AS49+'Mai-Ago 2025'!AS49+'Set-Dez 2025'!AS49+'Jan-Abr 2026'!AS49","v":0},{"$nulls":3},0,0,0,null,0,0,0,0,0,{"$f":"'Jan-Abr 2025'!BH49","v":0},{"$f":"'Jan-Abr 2025'!BG49+'Mai-Ago 2025'!BG49+'Set-Dez 2025'!BG49+'Jan-Abr 2026'!BG49","v":0},{"$nulls":3},0,0,0,null,0,0,0,0,0,{"$f":"'Jan-Abr 2025'!BV49","v":0},{"$f":"'Jan-Abr 2025'!BU49+'Mai-Ago 2025'!BU49+'Set-Dez 2025'!BU49+'Jan-Abr 2026'!BU49","v":0}]
[{"$nulls":36},0,0,0,null,0,0,0,0,0,{"$f":"'Jan-Abr 2025'!AT50","v":0},{"$f":"'Jan-Abr 2025'!AS50+'Mai-Ago 2025'!AS50+'Set-Dez 2025'!AS50+'Jan-Abr 2026'!AS50","v":0},{"$nulls":3},0,0,0,null,0,0,0,0,0,{"$f":"'Jan-Abr 2025'!BH50","v":0},{"$f":"'Jan-Abr 2025'!BG50+'Mai-Ago 2025'!BG50+'Set-Dez 2025'!BG50+'Jan-Abr 2026'!BG50","v":0},{"$nulls":3},0,0,0,null,0,0,0,0,0,{"$f":"'Jan-Abr 2025'!BV50","v":0},{"$f":"'Jan-Abr 2025'!BU50+'Mai-Ago 2025'!BU50+'Set-Dez 2025'!BU50+'Jan-Abr 2026'!BU50","v":0}]
["14h00 - 14h50",{"$nulls":35},0,0,0,null,0,0,0,0,0,{"$f":"'Jan-Abr 2025'!AT51","v":0},{"$f":"'Jan-Abr 2025'!AS51+'Mai-Ago 2025'!AS51+'Set-Dez 2025'!AS51+'Jan-Abr 2026'!AS51","v":0},{"$nulls":3},0,0,0,null,0,0,0,0,0,{"$f":"'Jan-Abr 2025'!BH51","v":0},{"$f":"'Jan-Abr 2025'!BG51+'Mai-Ago 2025'!BG51+'Set-Dez 2025'!BG51+'Jan-Abr 2026'!BG51","v":0},{"$nulls":3},0,0,0,null,0,0,0,0,0,{"$f":"'Jan-Abr 2025'!BV51","v":0},{"$f":"'Jan-Abr 2025'!BU51+'Mai-Ago 2025'!BU51+'Set-Dez 2025'!BU51+'Jan-Abr 2026'!BU51","v":0}]
["14h50 - 15h40",{"$nulls":35},0,0,0,null,0,0,0,0,0,{"$f":"'Jan-Abr 2025'!AT52","v":0},{"$f":"'Jan-Abr 2025'!AS52+'Mai-Ago 2025'!AS52+'Set-Dez 2025'!AS52+'Jan-Abr 2026'!AS52","v":0},{"$nulls":3},0,0,0,null,0,0,0,0,0,{"$f":"'Jan-Abr 2025'!BH52","v":0},{"$f":"'Jan-Abr 2025'!BG52+'Mai-Ago 2025'!BG52+'Set-Dez 2025'!BG52+'Jan-Abr 2026'!BG52","v":0},{"$nulls":3},0,0,0,null,0,0,0,0,0,{"$f":"'Jan-Abr 2025'!BV52","v":0},{"$f":"'Jan-Abr 2025'!BU52+'Mai-Ago 2025'!BU52+'Set-Dez 2025'!BU52+'Jan-Abr 2026'!BU52","v":0}]
["16h00 - 16h50",{"$nulls":35},0,0,0,null,0,0,0,0,0,{"$f":"'Jan-Abr 2025'!AT53","v":0},{"$f":"'Jan-Abr 2025'!AS53+'Mai-Ago 2025'!AS53+'Set-Dez 2025'!AS53+'Jan-Abr 2026'!AS53","v":0},{"$nulls":3},0,0,0,null,0,0,0,0,0,{"$f":"'Jan-Abr 2025'!BH53","v":0},{"$f":"'Jan-Abr 2025'!BG53+'Mai-Ago 2025'!BG53+'Set-Dez 2025'!BG53+'Jan-Abr 2026'!BG53","v":0},{"$nulls":3},0,0,0,null,0,0,0,0,0,{"$f":"'Jan-Abr 2025'!BV53","v":0},{"$f":"'Jan-Abr 2025'!BU53+'Mai-Ago 2025'!BU53+'Set-Dez 2025'!BU53+'Jan-Abr 2026'!BU53","v":0}]
["16h50 - 17h40",{"$nulls":35},0,0,0,null,0,0,0,0,0,{"$f":"'Jan-Abr 2025'!AT54","v":0},{"$f":"'Jan-Abr 2025'!AS54+'Mai-Ago 2025'!AS54+'Set-Dez 2025'!AS54+'Jan-Abr 2026'!AS54","v":0},{"$nulls":3},0,0,0,null,0,0,0,0,0,{"$f":"'Jan-Abr 2025'!BH54","v":0},{"$f":"'Jan-Abr 2025'!BG54+'Mai-Ago 2025'!BG54+'Set-Dez 2025'!BG54+'Jan-Abr 2026'!BG54","v":0},{"$nulls":3},0,0,0,null,0,0,0,0,0,{"$f":"'Jan-Abr 2025'!BV54","v":0},{"$f":"'Jan-Abr 2025'!BU54+'Mai-Ago 2025'!BU54+'Set-Dez 2025'!BU54+'Jan-Abr 2026'!BU54","v":0}]
[{"$nulls":32},"Fim",null,null,"PCT",0,0,0,560,0,0,0,0,0,{"$f":"'Jan-Abr 2025'!AT55","v":0},{"$f":"'Jan-Abr 2025'!AS55+'Mai-Ago 2025'!AS55+'Set-Dez 2025'!AS55+'Jan-Abr 2026'!AS55","v":0},{"$nulls":3},0,0,0,null,0,0,0,0,0,{"$f":"'Jan-Abr 2025'!BH55","v":0},{"$f":"'Jan-Abr 2025'!BG55+'Mai-Ago 2025'!BG55+'Set-Dez 2025'!BG55+'Jan-Abr 2026'!BG55","v":0},{"$nulls":3},0,0,0,null,0,0,0,0,0,{"$f":"'Jan-Abr 2025'!BV55","v":0},{"$f":"'Jan-Abr 2025'!BU55+'Mai-Ago 2025'!BU55+'Set-Dez 2025'!BU55+'Jan-Abr 2026'!BU55","v":0}]
["Sociocultural",5146,"IGO","Introdução à Gestão das Organizações",{"$nulls":5},"B153",25,{"$nulls":7},6418,"OEM","Órgãos e Elementos de Máquinas",{"$nulls":5},"C591",50,{"$nulls":8},0,0,0,null,0,0,0,0,0,{"$f":"'Jan-Abr 2025'!AT56","v":0},{"$f":"'Jan-Abr 2025'!AS56+'Mai-Ago 2025'!AS56+'Set-Dez 2025'!AS56+'Jan-Abr 2026'!AS56","v":0},{"$nulls":3},0,0,0,null,0,0,0,0,0,{"$f":"'Jan-Abr 2025'!BH56","v":0},{"$f":"'Jan-Abr 2025'!BG56+'Mai-Ago 2025'!BG56+'Set-Dez 2025'!BG56+'Jan-Abr 2026'!BG56","v":0},{"$nulls":3},0,0,0,null,0,0,0,0,0,{"$f":"'Jan-Abr 2025'!BV56","v":0},{"$f":"'Jan-Abr 2025'!BU56+'Mai-Ago 2025'!BU56+'Set-Dez 2025'!BU56+'Jan-Abr 2026'!BU56","v":0}]
[null,5152,"GMQ","Gestão e Motivação para a Qualidade",{"$nulls":5},"B155",25,{"$nulls":7},"6442","GP","Gestão de Projetos",{"$nulls":6},50,{"$nulls":8},0,0,0,null,0,0,0,0,0,{"$f":"'Jan-Abr 2025'!AT57","v":0},{"$f":"'Jan-Abr 2025'!AS57+'Mai-Ago 2025'!AS57+'Set-Dez 2025'!AS57+'Jan-Abr 2026'!AS57","v":0},{"$nulls":3},0,0,0,null,0,0,0,0,0,{"$f":"'Jan-Abr 2025'!BH57","v":0},{"$f":"'Jan-Abr 2025'!BG57+'Mai-Ago 2025'!BG57+'Set-Dez 2025'!BG57+'Jan-Abr 2026'!BG57","v":0},{"$nulls":3},0,0,0,null,0,0,0,0,0,{"$f":"'Jan-Abr 2025'!BV57","v":0},{"$f":"'Jan-Abr 2025'!BU57+'Mai-Ago 2025'!BU57+'Set-Dez 2025'!BU57+'Jan-Abr 2026'!BU57","v":0}]
[null,5149,"SGQ","Sistama de Gestão da Qualidade ISO 9001",{"$nulls":5},"F369",25,{"$nulls":7},"6443","PP","Planeamento da Produção",{"$nulls":6},50,{"$nulls":8},0,0,0,null,0,0,0,0,0,{"$f":"'Jan-Abr 2025'!AT58","v":0},{"$f":"'Jan-Abr 2025'!AS58+'Mai-Ago 2025'!AS58+'Set-Dez 2025'!AS58+'Jan-Abr 2026'!AS58","v":0},{"$nulls":3},0,0,0,null,0,0,0,0,0,{"$f":"'Jan-Abr 2025'!BH58","v":0},{"$f":"'Jan-Abr 2025'!BG58+'Mai-Ago 2025'!BG58+'Set-Dez 2025'!BG58+'Jan-Abr 2026'!BG58","v":0},{"$nulls":3},0,0,0,null,0,0,0,0,0,{"$f":"'Jan-Abr 2025'!BV58","v":0},{"$f":"'Jan-Abr 2025'!BU58+'Mai-Ago 2025'!BU58+'Set-Dez 2025'!BU58+'Jan-Abr 2026'!BU58","v":0}]
[null,349,"ASHST","Ambiente, Segurança, Higiene e Saúde no Trabalho",{"$nulls":5},"F423",25,{"$nulls":7},"6444","GS","Gestão de Stocks - Metodologias",{"$nulls":6},50,{"$nulls":8},0,0,0,null,0,0,0,0,0,{"$f":"'Jan-Abr 2025'!AT59","v":0},{"$f":"'Jan-Abr 2025'!AS59+'Mai-Ago 2025'!AS59+'Set-Dez 2025'!AS59+'Jan-Abr 2026'!AS59","v":0},{"$nulls":3},0,0,0,null,0,0,0,0,0,{"$f":"'Jan-Abr 2025'!BH59","v":0},{"$f":"'Jan-Abr 2025'!BG59+'Mai-Ago 2025'!BG59+'Set-Dez 2025'!BG59+'Jan-Abr 2026'!BG59","v":0},{"$nulls":3},0,0,0,null,0,0,0,0,0,{"$f":"'Jan-Abr 2025'!BV59","v":0},{"$f":"'Jan-Abr 2025'!BU59+'Mai-Ago 2025'!BU59+'Set-Dez 2025'!BU59+'Jan-Abr 2026'!BU59","v":0}]
[null,5653,"DT","Direito do Trabalho",{"$nulls":5},"B154",25,{"$nulls":7},"1054","CGO","Custeio e Gestão Orçamental",{"$nulls":6},50,{"$nulls":8},0,0,0,null,0,0,0,0,0,{"$f":"'Jan-Abr 2025'!AT60","v":0},{"$f":"'Jan-Abr 2025'!AS60+'Mai-Ago 2025'!AS60+'Set-Dez 2025'!AS60+'Jan-Abr 2026'!AS60","v":0},{"$nulls":3},0,0,0,null,0,0,0,0,0,{"$f":"'Jan-Abr 2025'!BH60","v":0},{"$f":"'Jan-Abr 2025'!BG60+'Mai-Ago 2025'!BG60+'Set-Dez 2025'!BG60+'Jan-Abr 2026'!BG60","v":0},{"$nulls":3},0,0,0,null,0,0,0,0,0,{"$f":"'Jan-Abr 2025'!BV60","v":0},{"$f":"'Jan-Abr 2025'!BU60+'Mai-Ago 2025'!BU60+'Set-Dez 2025'!BU60+'Jan-Abr 2026'!BU60","v":0}]
[null,5768,"ICS","Inglês em Contexto Socioprofissional",{"$nulls":5},"L046",25,{"$nulls":7},"6445","LOG","Logistica ",{"$nulls":6},50,{"$nulls":8},0,0,0,null,0,0,0,0,0,{"$f":"'Jan-Abr 2025'!AT61","v":0},{"$f":"'Jan-Abr 2025'!AS61+'Mai-Ago 2025'!AS61+'Set-Dez 2025'!AS61+'Jan-Abr 2026'!AS61","v":0},{"$nulls":3},0,0,0,null,0,0,0,0,0,{"$f":"'Jan-Abr 2025'!BH61","v":0},{"$f":"'Jan-Abr 2025'!BG61+'Mai-Ago 2025'!BG61+'Set-Dez 2025'!BG61+'Jan-Abr 2026'!BG61","v":0},{"$nulls":3},0,0,0,null,0,0,0,0,0,{"$f":"'Jan-Abr 2025'!BV61","v":0},{"$f":"'Jan-Abr 2025'!BU61+'Mai-Ago 2025'!BU61+'Set-Dez 2025'!BU61+'Jan-Abr 2026'!BU61","v":0}]
[{"$nulls":18},"6446","MOT","Métodos e Organização do Trabalho",{"$nulls":6},50,{"$nulls":8},0,0,0,null,0,0,0,0,0,{"$f":"'Jan-Abr 2025'!AT62","v":0},{"$f":"'Jan-Abr 2025'!AS62+'Mai-Ago 2025'!AS62+'Set-Dez 2025'!AS62+'Jan-Abr 2026'!AS62","v":0},{"$nulls":3},0,0,0,null,0,0,0,0,0,{"$f":"'Jan-Abr 2025'!BH62","v":0},{"$f":"'Jan-Abr 2025'!BG62+'Mai-Ago 2025'!BG62+'Set-Dez 2025'!BG62+'Jan-Abr 2026'!BG62","v":0},{"$nulls":3},0,0,0,null,0,0,0,0,0,{"$f":"'Jan-Abr 2025'!BV62","v":0},{"$f":"'Jan-Abr 2025'!BU62+'Mai-Ago 2025'!BU62+'Set-Dez 2025'!BU62+'Jan-Abr 2026'!BU62","v":0}]
[{"$nulls":18},"6447","SGI","Sistema de Gestão Integrada",{"$nulls":6},25,{"$nulls":8},0,0,0,null,0,0,0,0,0,{"$f":"'Jan-Abr 2025'!AT63","v":0},{"$f":"'Jan-Abr 2025'!AS63+'Mai-Ago 2025'!AS63+'Set-Dez 2025'!AS63+'Jan-Abr 2026'!AS63","v":0},{"$nulls":3},0,0,0,null,{"$f":"COUNTIF($C$10:$AG$18,$AX63)","v":0},{"$f":"COUNTIF($C$22:$AG$30,$AX63)","v":0},{"$f":"COUNTIF($C$34:$AG$42,$AX63)","v":0},{"$f":"COUNTIF($C$46:$AG$54,$AX63)","v":0},0,{"$f":"'Jan-Abr 2025'!BH63","v":0},{"$f":"'Jan-Abr 2025'!BG63+'Mai-Ago 2025'!BG63+'Set-Dez 2025'!BG63+'Jan-Abr 2026'!BG63","v":0},{"$nulls":3},0,0,0,null,0,0,0,0,0,{"$f":"'Jan-Abr 2025'!BV63","v":0},{"$f":"'Jan-Abr 2025'!BU63+'Mai-Ago 2025'!BU63+'Set-Dez 2025'!BU63+'Jan-Abr 2026'!BU63","v":0}]
["Tecnológica",6407,"PFL","Processos de Fundição / Ligação",{"$nulls":5},"D333",25,{"$nulls":7},"6448","QCEP","Qualidade - controlo estatístico de processo",{"$nulls":6},50,{"$nulls":8},0,0,0,null,0,0,0,0,0,{"$f":"'Jan-Abr 2025'!AT64","v":0},{"$f":"'Jan-Abr 2025'!AS64+'Mai-Ago 2025'!AS64+'Set-Dez 2025'!AS64+'Jan-Abr 2026'!AS64","v":0},{"$nulls":3},0,0,0,null,0,0,0,0,0,{"$f":"'Jan-Abr 2025'!BH64","v":0},{"$f":"'Jan-Abr 2025'!BG64+'Mai-Ago 2025'!BG64+'Set-Dez 2025'!BG64+'Jan-Abr 2026'!BG64","v":0},{"$nulls":3},0,0,0,null,0,0,0,0,0,{"$f":"'Jan-Abr 2025'!BV64","v":0},{"$f":"'Jan-Abr 2025'!BU64+'Mai-Ago 2025'!BU64+'Set-Dez 2025'!BU64+'Jan-Abr 2026'!BU64","v":0}]
[null,6408,"PCC","Processos de Conformação / Corte",{"$nulls":5},"D334",25,{"$nulls":25},0,0,0,null,0,0,0,0,0,{"$f":"'Jan-Abr 2025'!AT65","v":0},{"$f":"'Jan-Abr 2025'!AS65+'Mai-Ago 2025'!AS65+'Set-Dez 2025'!AS65+'Jan-Abr 2026'!AS65","v":0},{"$nulls":3},0,0,0,null,0,0,0,0,0,{"$f":"'Jan-Abr 2025'!BH65","v":0},{"$f":"'Jan-Abr 2025'!BG65+'Mai-Ago 2025'!BG65+'Set-Dez 2025'!BG65+'Jan-Abr 2026'!BG65","v":0},{"$nulls":3},0,0,0,null,0,0,0,{"$f":"COUNTIF($C$46:$AG$54,$BL65)","v":0},0,{"$f":"'Jan-Abr 2025'!BV65","v":0},{"$f":"'Jan-Abr 2025'!BU65+'Mai-Ago 2025'!BU65+'Set-Dez 2025'!BU65+'Jan-Abr 2026'!BU65","v":0}]
[null,6409,"PAA","Processos por Arranque de Apara",{"$nulls":5},"C588",25,{"$nulls":25},0,0,0,null,0,0,0,0,0,{"$f":"'Jan-Abr 2025'!AT66","v":0},{"$f":"'Jan-Abr 2025'!AS66+'Mai-Ago 2025'!AS66+'Set-Dez 2025'!AS66+'Jan-Abr 2026'!AS66","v":0},{"$nulls":3},0,0,0,null,0,0,0,0,0,{"$f":"'Jan-Abr 2025'!BH66","v":0},{"$f":"'Jan-Abr 2025'!BG66+'Mai-Ago 2025'!BG66+'Set-Dez 2025'!BG66+'Jan-Abr 2026'!BG66","v":0},{"$nulls":3},0,0,0,null,0,0,0,0,0,{"$f":"'Jan-Abr 2025'!BV66","v":0},{"$f":"'Jan-Abr 2025'!BU66+'Mai-Ago 2025'!BU66+'Set-Dez 2025'!BU66+'Jan-Abr 2026'!BU66","v":0}]
[null,6410,"IME","Instalação de Máquinas Elétricas",{"$nulls":5},"K252",50,{"$nulls":25},0,0,0,null,0,0,0,0,0,{"$f":"'Jan-Abr 2025'!AT67","v":0},{"$f":"'Jan-Abr 2025'!AS67+'Mai-Ago 2025'!AS67+'Set-Dez 2025'!AS67+'Jan-Abr 2026'!AS67","v":0},{"$nulls":3},0,0,0,null,0,0,0,0,0,{"$f":"'Jan-Abr 2025'!BH67","v":0},{"$f":"'Jan-Abr 2025'!BG67+'Mai-Ago 2025'!BG67+'Set-Dez 2025'!BG67+'Jan-Abr 2026'!BG67","v":0},{"$nulls":3},0,0,0,null,0,0,0,0,0,{"$f":"'Jan-Abr 2025'!BV67","v":0},{"$f":"'Jan-Abr 2025'!BU67+'Mai-Ago 2025'!BU67+'Set-Dez 2025'!BU67+'Jan-Abr 2026'!BU67","v":0}]
[null,6411,"ELE","Eletrónica",{"$nulls":5},"K253",50,{"$nulls":25},0,0,0,null,0,0,0,0,0,{"$f":"'Jan-Abr 2025'!AT68","v":0},{"$f":"'Jan-Abr 2025'!AS68+'Mai-Ago 2025'!AS68+'Set-Dez 2025'!AS68+'Jan-Abr 2026'!AS68","v":0},{"$nulls":3},0,0,0,null,0,0,0,0,0,{"$f":"'Jan-Abr 2025'!BH68","v":0},{"$f":"'Jan-Abr 2025'!BG68+'Mai-Ago 2025'!BG68+'Set-Dez 2025'!BG68+'Jan-Abr 2026'!BG68","v":0},{"$nulls":3},0,0,0,null,0,0,0,0,0,{"$f":"'Jan-Abr 2025'!BV68","v":0},{"$f":"'Jan-Abr 2025'!BU68+'Mai-Ago 2025'!BU68+'Set-Dez 2025'!BU68+'Jan-Abr 2026'!BU68","v":0}]
[null,6412,"CP","Circuitos Pneumáticos",{"$nulls":5},"E329",25,{"$nulls":25},0,0,0,null,0,0,0,0,0,{"$f":"'Jan-Abr 2025'!AT69","v":0},{"$f":"'Jan-Abr 2025'!AS69+'Mai-Ago 2025'!AS69+'Set-Dez 2025'!AS69+'Jan-Abr 2026'!AS69","v":0},{"$nulls":3},0,0,0,null,0,0,0,0,0,{"$f":"'Jan-Abr 2025'!BH69","v":0},{"$f":"'Jan-Abr 2025'!BG69+'Mai-Ago 2025'!BG69+'Set-Dez 2025'!BG69+'Jan-Abr 2026'!BG69","v":0},{"$nulls":3},0,0,0,null,0,0,0,0,0,{"$f":"'Jan-Abr 2025'!BV69","v":0},{"$f":"'Jan-Abr 2025'!BU69+'Mai-Ago 2025'!BU69+'Set-Dez 2025'!BU69+'Jan-Abr 2026'!BU69","v":0}]
[null,6413,"CH","Circuitos Óleo-Hidráulicos",{"$nulls":5},"E330",25,{"$nulls":6},"Estágio",null,"PCT","Prática em Contexto Trabalho",{"$nulls":5},"E368",560,{"$nulls":8},0,0,0,null,0,0,0,0,0,{"$f":"'Jan-Abr 2025'!AT70","v":0},{"$f":"'Jan-Abr 2025'!AS70+'Mai-Ago 2025'!AS70+'Set-Dez 2025'!AS70+'Jan-Abr 2026'!AS70","v":0},{"$nulls":3},0,0,0,null,0,0,0,0,0,{"$f":"'Jan-Abr 2025'!BH70","v":0},{"$f":"'Jan-Abr 2025'!BG70+'Mai-Ago 2025'!BG70+'Set-Dez 2025'!BG70+'Jan-Abr 2026'!BG70","v":0},{"$nulls":3},0,0,0,null,0,0,0,0,0,{"$f":"'Jan-Abr 2025'!BV70","v":0},{"$f":"'Jan-Abr 2025'!BU70+'Mai-Ago 2025'!BU70+'Set-Dez 2025'!BU70+'Jan-Abr 2026'!BU70","v":0}]
[null,6414,"CLP","Controladores Lógicos Programáveis",{"$nulls":5},"C589",50,{"$nulls":25},0,0,0,null,0,0,0,0,0,{"$f":"'Jan-Abr 2025'!AT71","v":0},{"$f":"'Jan-Abr 2025'!AS71+'Mai-Ago 2025'!AS71+'Set-Dez 2025'!AS71+'Jan-Abr 2026'!AS71","v":0},{"$nulls":3},0,0,0,null,0,0,0,0,0,{"$f":"'Jan-Abr 2025'!BH71","v":0},{"$f":"'Jan-Abr 2025'!BG71+'Mai-Ago 2025'!BG71+'Set-Dez 2025'!BG71+'Jan-Abr 2026'!BG71","v":0},{"$nulls":3},0,0,0,null,0,0,0,0,0,{"$f":"'Jan-Abr 2025'!BV71","v":0},{"$f":"'Jan-Abr 2025'!BU71+'Mai-Ago 2025'!BU71+'Set-Dez 2025'!BU71+'Jan-Abr 2026'!BU71","v":0}]
[null,6415,"DCM","Desenho de Construções Mecânicas",{"$nulls":5},"A438",50,{"$nulls":25},{"$f":"IF(AI72=$DC$8,AM72,IF(AI72=$DC$9,AM72,IF(AI72=$DC$10,AL72,)))","v":0},0,{"$f":"IF(AI72=$DC$8,AL72,IF(AI72=$DC$9,AM73+AL72,IF(AI72=$DC$10,IF(AI73=$DC$10,AM73+AL72,AL72),)))","v":0},null,0,0,0,0,{"$f":"SUM(AO72:AR72)","v":0},{"$f":"'Jan-Abr 2025'!AT72","v":0},{"$f":"'Jan-Abr 2025'!AS72+'Mai-Ago 2025'!AS72+'Set-Dez 2025'!AS72+'Jan-Abr 2026'!AS72","v":0},{"$nulls":3},{"$f":"IF(AW72=$DC$8,BA72,IF(AW72=$DC$9,BA72,IF(AW72=$DC$10,AZ72,)))","v":0},0,{"$f":"IF(AW72=$DC$8,AZ72,IF(AW72=$DC$9,BA73+AZ72,IF(AW72=$DC$10,IF(AW73=$DC$10,BA73+AZ72,AZ72),)))","v":0},null,0,0,0,0,0,{"$f":"'Jan-Abr 2025'!BH72","v":0},{"$f":"'Jan-Abr 2025'!BG72+'Mai-Ago 2025'!BG72+'Set-Dez 2025'!BG72+'Jan-Abr 2026'!BG72","v":0},{"$nulls":3},{"$f":"IF(BK72=$DC$8,BO72,IF(BK72=$DC$9,BO72,IF(BK72=$DC$10,BN72,)))","v":0},0,{"$f":"IF(BK72=$DC$8,BN72,IF(BK72=$DC$9,BO73+BN72,IF(BK72=$DC$10,IF(BK73=$DC$10,BO73+BN72,BN72),)))","v":0},null,0,0,0,0,{"$f":"SUM(BQ72:BT72)","v":0},{"$f":"'Jan-Abr 2025'!BV72","v":0},{"$f":"'Jan-Abr 2025'!BU72+'Mai-Ago 2025'!BU72+'Set-Dez 2025'!BU72+'Jan-Abr 2026'!BU72","v":0}]
[null,6416,"CM","Ciência dos Materiais",{"$nulls":5},"C590",50,{"$nulls":25},0,{"$f":"IF($AK$4=$DB$8,AS73,IF($AK$4=$DB$9,AT73,IF($AK$4=$DB$10,AU73,IF($AK$4=$DB$11,AO73,IF($AK$4=$DB$12,AP73,IF($AK$4=$DB$13,AQ73,IF($AK$4=$DB$14,AR73,\"\")))))))","v":0},0,null,{"$f":"COUNTIF($C$10:$AG$18,$AJ73)","v":0},{"$f":"COUNTIF($C$22:$AG$30,$AJ73)","v":0},{"$f":"COUNTIF($C$34:$AG$42,$AJ73)","v":0},{"$f":"COUNTIF($C$46:$AG$54,$AJ73)","v":0},0,{"$f":"'Jan-Abr 2025'!AT73","v":0},{"$f":"'Jan-Abr 2025'!AS73+'Mai-Ago 2025'!AS73+'Set-Dez 2025'!AS73+'Jan-Abr 2026'!AS73","v":0},{"$nulls":3},0,{"$f":"IF($AK$4=$DB$8,BG73,IF($AK$4=$DB$9,BH73,IF($AK$4=$DB$10,BI73,IF($AK$4=$DB$11,BC73,IF($AK$4=$DB$12,BD73,IF($AK$4=$DB$13,BE73,IF($AK$4=$DB$14,BF73,\"\")))))))","v":0},0,null,{"$f":"COUNTIF($C$10:$AG$18,$AX73)","v":0},{"$f":"COUNTIF($C$22:$AG$30,$AX73)","v":0},{"$f":"COUNTIF($C$34:$AG$42,$AX73)","v":0},{"$f":"COUNTIF($C$46:$AG$54,$AX73)","v":0},{"$f":"SUM(BC73:BF73)","v":0},{"$f":"'Jan-Abr 2025'!BH73","v":0},{"$f":"'Jan-Abr 2025'!BG73+'Mai-Ago 2025'!BG73+'Set-Dez 2025'!BG73+'Jan-Abr 2026'!BG73","v":0},{"$nulls":3},0,{"$f":"IF($AK$4=$DB$8,BU73,IF($AK$4=$DB$9,BV73,IF($AK$4=$DB$10,BW73,IF($AK$4=$DB$11,BQ73,IF($AK$4=$DB$12,BR73,IF($AK$4=$DB$13,BS73,IF($AK$4=$DB$14,BT73,\"\")))))))","v":0},0,null,{"$f":"COUNTIF($C$10:$AG$18,$BL73)","v":0},{"$f":"COUNTIF($C$22:$AG$30,$BL73)","v":0},{"$f":"COUNTIF($C$34:$AG$42,$BL73)","v":0},{"$f":"COUNTIF($C$46:$AG$54,$BL73)","v":0},0,{"$f":"'Jan-Abr 2025'!BV73","v":0},{"$f":"'Jan-Abr 2025'!BU73+'Mai-Ago 2025'!BU73+'Set-Dez 2025'!BU73+'Jan-Abr 2026'!BU73","v":0}]
[null,6417,"SD","Sistemas Digitais",{"$nulls":5},"I159",50,{"$nulls":9},"Seg.","Ter.","Qua.","Qui.","Sex."]
[{"$nulls":19},"Salas:",{"$nulls":16},{"$f":"SUMIF(AI8:AI73,\"=M\",AK8:AK73)+SUMIF(AI8:AI73,\"=T\",AK8:AK73)","v":0},null,null,{"$f":"SUMIF(AI8:AI73,\"=M\",AN8:AN73)+SUMIF(AI8:AI73,\"=T\",AN8:AN73)","v":0},{"$nulls":10},{"$f":"SUMIF(AW8:AW73,\"=M\",AY8:AY73)+SUMIF(AW8:AW73,\"=T\",AY8:AY73)","v":0},null,null,{"$f":"SUMIF(AW8:AW73,\"=M\",BB8:BB73)+SUMIF(AW8:AW73,\"=T\",BB8:BB73)","v":0},{"$nulls":10},{"$f":"SUMIF(BK8:BK73,\"=M\",BM8:BM73)+SUMIF(BK8:BK73,\"=T\",BM8:BM73)","v":0},null,null,{"$f":"SUMIF(BK8:BK73,\"=M\",BP8:BP73)+SUMIF(BK8:BK73,\"=T\",BP8:BP73)","v":0}]
[{"$nulls":34},"Totais",null,{"$f":"AK75+AY75+BM75","v":0},null,null,{"$f":"AN75+BB75+BP75","v":0}]
["R. Quantitativas:"]

{"sheet":"Mai-Ago 2026","index":5,"n_rows":77,"n_cols":107,"rows_kept":77,"merged":[[0,25,0,32],[0,34,2,39],[0,40,6,40],[0,41,6,41],[0,42,6,42],[0,43,6,43],[0,44,6,44],[0,45,6,45],[0,46,6,46],[0,48,2,53],[0,54,6,54],[0,55,6,55],[0,56,6,56],[0,57,6,57],[0,58,6,58],[0,59,6,59],[0,60,6,60],[0,62,2,67],[0,68,6,68],[0,69,6,69],[0,70,6,70],[0,71,6,71],[0,72,6,72],[0,73,6,73],[0,74,6,74],[0,105,6,105],[0,106,6,106],[1,25,1,32],[2,25,2,32],[3,25,3,32],[3,34,6,34],[3,35,6,35],[3,36,6,36],[3,37,6,37],[3,38,6,38],[3,39,6,39],[3,48,6,48],[3,49,6,49],[3,50,6,50],[3,51,6,51],[3,52,6,52],[3,53,6,53],[3,62,6,62],[3,63,6,63],[3,64,6,64],[3,65,6,65],[3,66,6,66],[3,67,6,67],[4,0,4,2],[4,3,4,9],[4,10,4,13],[4,14,4,21],[4,22,4,26],[4,27,4,29],[4,30,4,32],[5,0,5,2],[5,3,5,9],[5,10,5,13],[5,14,5,21],[5,22,5,26],[5,27,5,29],[5,30,5,32],[6,0,6,2],[6,3,6,9],[6,10,6,13],[6,14,6,21],[6,22,6,26],[6,27,6,29],[6,30,6,32],[7,0,8,1],[9,0,9,1],[10,0,10,1],[11,0,11,1],[12,0,12,1],[14,0,14,1],[15,0,15,1],[16,0,16,1],[17,0,17,1],[19,0,20,1],[21,0,21,1],[22,0,22,1],[23,0,23,1],[24,0,24,1],[25,0,25,1],[26,0,26,1],[27,0,27,1],[28,0,28,1],[29,0,29,1],[31,0,32,1],[33,0,33,1],[34,0,34,1],[35,0,35,1],[36,0,36,1],[37,0,37,1],[38,0,38,1],[39,0,39,1],[40,0,40,1],[41,0,41,1],[43,0,44,1],[45,0,45,1],[46,0,46,1],[47,0,47,1],[48,0,48,1],[49,0,49,1],[50,0,50,1],[51,0,51,1],[52,0,52,1],[53,0,53,1],[54,2,54,8],[54,11,54,13],[54,17,54,19],[54,20,54,25],[54,28,54,30],[55,0,60,0],[55,3,55,8],[55,11,55,13],[55,17,63,17],[55,20,55,25],[55,28,55,30],[56,3,56,8],[56,11,56,13],[56,20,56,25],[56,28,56,30],[57,3,57,8],[57,11,57,13],[57,20,57,25],[57,28,57,30],[58,3,58,8],[58,11,58,13],[58,20,58,25],[58,28,58,30],[59,3,59,8],[59,11,59,13],[59,20,59,25],[59,28,59,30],[60,3,60,8],[60,11,60,13],[60,20,60,25],[60,28,60,30],[61,20,61,25],[61,28,61,30],[62,20,62,25],[63,0,73,0],[63,3,63,8],[63,11,63,13],[63,20,63,25],[64,3,64,8],[64,11,64,13],[65,3,65,8],[65,11,65,13],[66,3,66,8],[66,11,66,13],[67,3,67,8],[67,11,67,13],[68,3,68,8],[68,11,68,13],[69,3,69,8],[69,11,69,13],[70,3,70,8],[70,11,70,13],[71,3,71,8],[71,11,71,13],[72,3,72,8],[72,11,72,13],[73,3,73,8],[73,11,73,13],[75,34,75,35],[76,2,76,3],[76,4,76,5],[76,6,76,7],[76,8,76,9],[76,10,76,11],[76,12,76,13]]}
[{"$nulls":40},{"$f":"TEXT($A$8,\"mmm\")","v":"mai"},{"$f":"TEXT($A$20,\"mmm\")","v":"jun"},{"$f":"TEXT($A$32,\"mmm\")","v":"jul"},{"$f":"TEXT($A$44,\"mmm\")","v":"ago"},"Total  Folha","Total Global","Total  Acum.",{"$nulls":7},{"$f":"TEXT($A$8,\"mmm\")","v":"mai"},{"$f":"TEXT($A$20,\"mmm\")","v":"jun"},{"$f":"TEXT($A$32,\"mmm\")","v":"jul"},{"$f":"TEXT($A$44,\"mmm\")","v":"ago"},"Total  Folha","Total Global","Total  Acum.",{"$nulls":7},{"$f":"TEXT($A$8,\"mmm\")","v":"mai"},{"$f":"TEXT($A$20,\"mmm\")","v":"jun"},{"$f":"TEXT($A$32,\"mmm\")","v":"jul"},{"$f":"TEXT($A$44,\"mmm\")","v":"ago"},"Total  Folha","Total Global","Total  Acum.",{"$nulls":30},"tipo_soma","tipo_contador"]
[{"$nulls":25},"Director(a):"]
[{"$nulls":25},"(Cristina Botas)"]
[{"$nulls":34},"Tipo","Módulo","ST","Origem","Cálculo","Objetivo",{"$nulls":8},"Tipo","Módulo",{"$f":"AK4","v":"ST"},"Origem","Cálculo","Objetivo",{"$nulls":8},"Tipo","Módulo",{"$f":"AK4","v":"ST"},"Origem","Cálculo","Objetivo"]
["MODALIDADE:",{"$nulls":9},"CODÍGO DA AÇÃO:",{"$nulls":16},"       U.O.:",null,null,"Torres Vedras"]
["PLANEAMENTO:",{"$nulls":9},"SAÍDA PROFISSIONAL: Técnico/a Especialista em Mecatrónica",{"$nulls":16},"DATA INÍCIO:"]
["COORDENADOR:",{"$nulls":9},"DURAÇÃO:",{"$nulls":16},"DATA FIM  (previsto):"]
["2026-05-01",null,{"$f":"IF(C9<>\"\",CHOOSE(WEEKDAY(C9,1),\"Dom.\",\"Seg.\",\"Ter.\",\"Qua.\",\"Qui.\",\"Sex.\",\"Sáb.\"),\"\")","v":"Sex."},{"$f":"IF(D9<>\"\",CHOOSE(WEEKDAY(D9,1),\"Dom.\",\"Seg.\",\"Ter.\",\"Qua.\",\"Qui.\",\"Sex.\",\"Sáb.\"),\"\")","v":"Sáb."},"Dom.","Seg.","Ter.","Qua.","Qui.","Sex.","Sáb.","Dom.","Seg.","Ter.","Qua.","Qui.","Sex.","Sáb.","Dom.","Seg.","Ter.","Qua.","Qui.","Sex.","Sáb.","Dom.","Seg.","Ter.","Qua.","Qui.","Sex.","Sáb.","Dom.",null,null,"IGO",{"$f":"IF(AI8=$DC$8,AM8,IF(AI8=$DC$9,AM8,IF(AI8=$DC$10,AL8,)))","v":0},{"$f":"IF($AK$4=$DB$8,AS8,IF($AK$4=$DB$9,AT8,IF($AK$4=$DB$10,AU8,IF($AK$4=$DB$11,AO8,IF($AK$4=$DB$12,AP8,IF($AK$4=$DB$13,AQ8,IF($AK$4=$DB$14,AR8,\"\")))))))","v":0},{"$f":"IF(AI8=$DC$8,AL8,IF(AI8=$DC$9,AM9+AL8,IF(AI8=$DC$10,IF(AI9=$DC$10,AM9+AL8,AL8),)))","v":0},25,{"$f":"COUNTIF($C$10:$AG$18,$AJ8)","v":0},{"$f":"COUNTIF($C$22:$AG$30,$AJ8)","v":0},{"$f":"COUNTIF($C$34:$AG$42,$AJ8)","v":0},{"$f":"COUNTIF($C$46:$AG$54,$AJ8)","v":0},{"$f":"SUM(AO8:AR8)","v":0},{"$f":"'Jan-Abr 2025'!AT8","v":0},{"$f":"'Jan-Abr 2025'!AS8+'Mai-Ago 2025'!AS8+'Set-Dez 2025'!AS8+'Jan-Abr 2026'!AS8+'Mai-Ago 2026'!AS8","v":0},{"$nulls":3},{"$f":"IF(AW8=$DC$8,BA8,IF(AW8=$DC$9,BA8,IF(AW8=$DC$10,AZ8,)))","v":0},{"$f":"IF($AK$4=$DB$8,BG8,IF($AK$4=$DB$9,BH8,IF($AK$4=$DB$10,BI8,IF($AK$4=$DB$11,BC8,IF($AK$4=$DB$12,BD8,IF($AK$4=$DB$13,BE8,IF($AK$4=$DB$14,BF8,\"\")))))))","v":0},{"$f":"IF(AW8=$DC$8,AZ8,IF(AW8=$DC$9,BA9+AZ8,IF(AW8=$DC$10,IF(AW9=$DC$10,BA9+AZ8,AZ8),)))","v":0},null,{"$f":"COUNTIF($C$10:$AG$18,$AX8)","v":0},{"$f":"COUNTIF($C$22:$AG$30,$AX8)","v":0},{"$f":"COUNTIF($C$34:$AG$42,$AX8)","v":0},{"$f":"COUNTIF($C$46:$AG$54,$AX8)","v":0},{"$f":"SUM(BC8:BF8)","v":0},{"$f":"'Jan-Abr 2025'!BH8","v":0},{"$f":"'Jan-Abr 2025'!BG8+'Mai-Ago 2025'!BG8+'Set-Dez 2025'!BG8+'Jan-Abr 2026'!BG8+'Mai-Ago 2026'!BG8","v":0},{"$nulls":3},{"$f":"IF(BK8=$DC$8,BO8,IF(BK8=$DC$9,BO8,IF(BK8=$DC$10,BN8,)))","v":0},{"$f":"IF($AK$4=$DB$8,BU8,IF($AK$4=$DB$9,BV8,IF($AK$4=$DB$10,BW8,IF($AK$4=$DB$11,BQ8,IF($AK$4=$DB$12,BR8,IF($AK$4=$DB$13,BS8,IF($AK$4=$DB$14,BT8,\"\")))))))","v":0},{"$f":"IF(BK8=$DC$8,BN8,IF(BK8=$DC$9,BO9+BN8,IF(BK8=$DC$10,IF(BK9=$DC$10,BO9+BN8,BN8),)))","v":0},null,{"$f":"COUNTIF($C$10:$AG$18,$BL8)","v":0},{"$f":"COUNTIF($C$22:$AG$30,$BL8)","v":0},{"$f":"COUNTIF($C$34:$AG$42,$BL8)","v":0},{"$f":"COUNTIF($C$46:$AG$54,$BL8)","v":0},{"$f":"SUM(BQ8:BT8)","v":0},{"$f":"'Jan-Abr 2025'!BV8","v":0},{"$f":"'Jan-Abr 2025'!BU8+'Mai-Ago 2025'!BU8+'Set-Dez 2025'!BU8+'Jan-Abr 2026'!BU8+'Mai-Ago 2026'!BU8","v":0},{"$nulls":30},"SF","M"]
[null,null,{"$f":"A8","v":"2026-05-01"},{"$f":"IF(C9=\"\",\"\",IF(DAY(C9)<DAY(EOMONTH(C9,0)),C9+1,\"\"))","v":"2026-05-02"},{"$f":"IF(D9=\"\",\"\",IF(DAY(D9)<DAY(EOMONTH(D9,0)),D9+1,\"\"))","v":"2026-05-03"},"2026-05-04","2026-05-05","2026-05-06","2026-05-07","2026-05-08",{"$f":"IF(J9=\"\",\"\",IF(DAY(J9)<DAY(EOMONTH(J9,0)),J9+1,\"\"))","v":"2026-05-09"},{"$f":"IF(K9=\"\",\"\",IF(DAY(K9)<DAY(EOMONTH(K9,0)),K9+1,\"\"))","v":"2026-05-10"},"2026-05-11","2026-05-12","2026-05-13","2026-05-14","2026-05-15",{"$f":"IF(Q9=\"\",\"\",IF(DAY(Q9)<DAY(EOMONTH(Q9,0)),Q9+1,\"\"))","v":"2026-05-16"},{"$f":"IF(R9=\"\",\"\",IF(DAY(R9)<DAY(EOMONTH(R9,0)),R9+1,\"\"))","v":"2026-05-17"},"2026-05-18","2026-05-19","2026-05-20","2026-05-21","2026-05-22",{"$f":"IF(X9=\"\",\"\",IF(DAY(X9)<DAY(EOMONTH(X9,0)),X9+1,\"\"))","v":"2026-05-23"},{"$f":"IF(Y9=\"\",\"\",IF(DAY(Y9)<DAY(EOMONTH(Y9,0)),Y9+1,\"\"))","v":"2026-05-24"},"2026-05-25","2026-05-26","2026-05-27","2026-05-28","2026-05-29",{"$f":"IF(AE9=\"\",\"\",IF(DAY(AE9)<DAY(EOMONTH(AE9,0)),AE9+1,\"\"))","v":"2026-05-30"},{"$f":"IF(AF9=\"\",\"\",IF(DAY(AF9)<DAY(EOMONTH(AF9,0)),AF9+1,\"\"))","v":"2026-05-31"},null,null,"GMQ",0,{"$f":"IF($AK$4=$DB$8,AS9,IF($AK$4=$DB$9,AT9,IF($AK$4=$DB$10,AU9,IF($AK$4=$DB$11,AO9,IF($AK$4=$DB$12,AP9,IF($AK$4=$DB$13,AQ9,IF($AK$4=$DB$14,AR9,\"\")))))))","v":0},0,25,{"$f":"COUNTIF($C$10:$AG$18,$AJ9)","v":0},{"$f":"COUNTIF($C$22:$AG$30,$AJ9)","v":0},{"$f":"COUNTIF($C$34:$AG$42,$AJ9)","v":0},{"$f":"COUNTIF($C$46:$AG$54,$AJ9)","v":0},0,{"$f":"'Jan-Abr 2025'!AT9","v":0},{"$f":"'Jan-Abr 2025'!AS9+'Mai-Ago 2025'!AS9+'Set-Dez 2025'!AS9+'Jan-Abr 2026'!AS9+'Mai-Ago 2026'!AS9","v":0},{"$nulls":3},0,{"$f":"IF($AK$4=$DB$8,BG9,IF($AK$4=$DB$9,BH9,IF($AK$4=$DB$10,BI9,IF($AK$4=$DB$11,BC9,IF($AK$4=$DB$12,BD9,IF($AK$4=$DB$13,BE9,IF($AK$4=$DB$14,BF9,\"\")))))))","v":0},0,null,{"$f":"COUNTIF($C$10:$AG$18,$AX9)","v":0},{"$f":"COUNTIF($C$22:$AG$30,$AX9)","v":0},{"$f":"COUNTIF($C$34:$AG$42,$AX9)","v":0},{"$f":"COUNTIF($C$46:$AG$54,$AX9)","v":0},{"$f":"SUM(BC9:BF9)","v":0},{"$f":"'Jan-Abr 2025'!BH9","v":0},{"$f":"'Jan-Abr 2025'!BG9+'Mai-Ago 2025'!BG9+'Set-Dez 2025'!BG9+'Jan-Abr 2026'!BG9+'Mai-Ago 2026'!BG9","v":0},{"$nulls":3},0,{"$f":"IF($AK$4=$DB$8,BU9,IF($AK$4=$DB$9,BV9,IF($AK$4=$DB$10,BW9,IF($AK$4=$DB$11,BQ9,IF($AK$4=$DB$12,BR9,IF($AK$4=$DB$13,BS9,IF($AK$4=$DB$14,BT9,\"\")))))))","v":0},0,null,{"$f":"COUNTIF($C$10:$AG$18,$BL9)","v":0},{"$f":"COUNTIF($C$22:$AG$30,$BL9)","v":0},{"$f":"COUNTIF($C$34:$AG$42,$BL9)","v":0},{"$f":"COUNTIF($C$46:$AG$54,$BL9)","v":0},0,{"$f":"'Jan-Abr 2025'!BV9","v":0},{"$f":"'Jan-Abr 2025'!BU9+'Mai-Ago 2025'!BU9+'Set-Dez 2025'!BU9+'Jan-Abr 2026'!BU9+'Mai-Ago 2026'!BU9","v":0},{"$nulls":30},"ST","T"]
["09h00 - 09h50",{"$nulls":34},"SGQ",0,0,0,25,0,0,0,0,0,{"$f":"'Jan-Abr 2025'!AT10","v":0},{"$f":"'Jan-Abr 2025'!AS10+'Mai-Ago 2025'!AS10+'Set-Dez 2025'!AS10+'Jan-Abr 2026'!AS10+'Mai-Ago 2026'!AS10","v":0},{"$nulls":3},0,0,0,null,0,0,0,0,0,{"$f":"'Jan-Abr 2025'!BH10","v":0},{"$f":"'Jan-Abr 2025'!BG10+'Mai-Ago 2025'!BG10+'Set-Dez 2025'!BG10+'Jan-Abr 2026'!BG10+'Mai-Ago 2026'!BG10","v":0},{"$nulls":3},0,0,0,null,0,0,0,0,0,{"$f":"'Jan-Abr 2025'!BV10","v":0},{"$f":"'Jan-Abr 2025'!BU10+'Mai-Ago 2025'!BU10+'Set-Dez 2025'!BU10+'Jan-Abr 2026'!BU10+'Mai-Ago 2026'!BU10","v":0},{"$nulls":30},"SA","P"]
["09h50 - 10h40",null,"Trab.",{"$nulls":32},"ASHST",0,0,0,25,0,0,0,0,0,{"$f":"'Jan-Abr 2025'!AT11","v":0},{"$f":"'Jan-Abr 2025'!AS11+'Mai-Ago 2025'!AS11+'Set-Dez 2025'!AS11+'Jan-Abr 2026'!AS11+'Mai-Ago 2026'!AS11","v":0},{"$nulls":3},0,0,0,null,0,0,0,0,0,{"$f":"'Jan-Abr 2025'!BH11","v":0},{"$f":"'Jan-Abr 2025'!BG11+'Mai-Ago 2025'!BG11+'Set-Dez 2025'!BG11+'Jan-Abr 2026'!BG11+'Mai-Ago 2026'!BG11","v":0},{"$nulls":3},0,0,0,null,0,0,0,0,0,{"$f":"'Jan-Abr 2025'!BV11","v":0},{"$f":"'Jan-Abr 2025'!BU11+'Mai-Ago 2025'!BU11+'Set-Dez 2025'!BU11+'Jan-Abr 2026'!BU11+'Mai-Ago 2026'!BU11","v":0},{"$nulls":30},{"$f":"TEXT(A8,\"mmm\")","v":"mai"}]
["11h00 - 11h50",{"$nulls":34},"DT",0,0,0,25,0,0,0,0,0,{"$f":"'Jan-Abr 2025'!AT12","v":0},{"$f":"'Jan-Abr 2025'!AS12+'Mai-Ago 2025'!AS12+'Set-Dez 2025'!AS12+'Jan-Abr 2026'!AS12+'Mai-Ago 2026'!AS12","v":0},{"$nulls":3},0,0,0,null,0,0,0,0,0,{"$f":"'Jan-Abr 2025'!BH12","v":0},{"$f":"'Jan-Abr 2025'!BG12+'Mai-Ago 2025'!BG12+'Set-Dez 2025'!BG12+'Jan-Abr 2026'!BG12+'Mai-Ago 2026'!BG12","v":0},{"$nulls":3},0,0,0,null,0,0,0,0,0,{"$f":"'Jan-Abr 2025'!BV12","v":0},{"$f":"'Jan-Abr 2025'!BU12+'Mai-Ago 2025'!BU12+'Set-Dez 2025'!BU12+'Jan-Abr 2026'!BU12+'Mai-Ago 2026'!BU12","v":0},{"$nulls":30},{"$f":"TEXT(A20,\"mmm\")","v":"jun"}]
["11h50 - 12h40",{"$nulls":34},"ICS",0,0,0,25,0,0,0,0,0,{"$f":"'Jan-Abr 2025'!AT13","v":0},{"$f":"'Jan-Abr 2025'!AS13+'Mai-Ago 2025'!AS13+'Set-Dez 2025'!AS13+'Jan-Abr 2026'!AS13+'Mai-Ago 2026'!AS13","v":0},{"$nulls":3},0,0,0,null,0,0,0,0,0,{"$f":"'Jan-Abr 2025'!BH13","v":0},{"$f":"'Jan-Abr 2025'!BG13+'Mai-Ago 2025'!BG13+'Set-Dez 2025'!BG13+'Jan-Abr 2026'!BG13+'Mai-Ago 2026'!BG13","v":0},{"$nulls":3},0,0,0,null,0,0,0,0,0,{"$f":"'Jan-Abr 2025'!BV13","v":0},{"$f":"'Jan-Abr 2025'!BU13+'Mai-Ago 2025'!BU13+'Set-Dez 2025'!BU13+'Jan-Abr 2026'!BU13+'Mai-Ago 2026'!BU13","v":0},{"$nulls":30},{"$f":"TEXT(A32,\"mmm\")","v":"jul"}]
[{"$nulls":36},0,0,0,null,0,0,0,0,0,{"$f":"'Jan-Abr 2025'!AT14","v":0},{"$f":"'Jan-Abr 2025'!AS14+'Mai-Ago 2025'!AS14+'Set-Dez 2025'!AS14+'Jan-Abr 2026'!AS14+'Mai-Ago 2026'!AS14","v":0},{"$nulls":3},0,0,0,null,0,0,0,0,0,{"$f":"'Jan-Abr 2025'!BH14","v":0},{"$f":"'Jan-Abr 2025'!BG14+'Mai-Ago 2025'!BG14+'Set-Dez 2025'!BG14+'Jan-Abr 2026'!BG14+'Mai-Ago 2026'!BG14","v":0},{"$nulls":3},0,0,0,null,0,0,0,0,0,{"$f":"'Jan-Abr 2025'!BV14","v":0},{"$f":"'Jan-Abr 2025'!BU14+'Mai-Ago 2025'!BU14+'Set-Dez 2025'!BU14+'Jan-Abr 2026'!BU14+'Mai-Ago 2026'!BU14","v":0},{"$nulls":30},{"$f":"TEXT(A44,\"mmm\")","v":"ago"}]
["14h00 - 14h50",{"$nulls":34},"PFL",0,0,0,25,0,0,0,0,0,{"$f":"'Jan-Abr 2025'!AT15","v":0},{"$f":"'Jan-Abr 2025'!AS15+'Mai-Ago 2025'!AS15+'Set-Dez 2025'!AS15+'Jan-Abr 2026'!AS15+'Mai-Ago 2026'!AS15","v":0},{"$nulls":3},0,0,0,null,0,0,0,0,0,{"$f":"'Jan-Abr 2025'!BH15","v":0},{"$f":"'Jan-Abr 2025'!BG15+'Mai-Ago 2025'!BG15+'Set-Dez 2025'!BG15+'Jan-Abr 2026'!BG15+'Mai-Ago 2026'!BG15","v":0},{"$nulls":3},0,0,0,null,0,0,0,0,0,{"$f":"'Jan-Abr 2025'!BV15","v":0},{"$f":"'Jan-Abr 2025'!BU15+'Mai-Ago 2025'!BU15+'Set-Dez 2025'!BU15+'Jan-Abr 2026'!BU15+'Mai-Ago 2026'!BU15","v":0}]
["14h50 - 15h40",{"$nulls":34},"PCC",0,0,0,25,0,0,0,0,0,{"$f":"'Jan-Abr 2025'!AT16","v":0},{"$f":"'Jan-Abr 2025'!AS16+'Mai-Ago 2025'!AS16+'Set-Dez 2025'!AS16+'Jan-Abr 2026'!AS16+'Mai-Ago 2026'!AS16","v":0},{"$nulls":3},0,0,0,null,0,0,0,0,0,{"$f":"'Jan-Abr 2025'!BH16","v":0},{"$f":"'Jan-Abr 2025'!BG16+'Mai-Ago 2025'!BG16+'Set-Dez 2025'!BG16+'Jan-Abr 2026'!BG16+'Mai-Ago 2026'!BG16","v":0},{"$nulls":3},0,0,0,null,0,0,0,0,0,{"$f":"'Jan-Abr 2025'!BV16","v":0},{"$f":"'Jan-Abr 2025'!BU16+'Mai-Ago 2025'!BU16+'Set-Dez 2025'!BU16+'Jan-Abr 2026'!BU16+'Mai-Ago 2026'!BU16","v":0}]
["16h00 - 16h50",{"$nulls":34},"PAA",0,0,0,25,0,0,0,0,0,{"$f":"'Jan-Abr 2025'!AT17","v":0},{"$f":"'Jan-Abr 2025'!AS17+'Mai-Ago 2025'!AS17+'Set-Dez 2025'!AS17+'Jan-Abr 2026'!AS17+'Mai-Ago 2026'!AS17","v":0},{"$nulls":3},0,0,0,null,0,0,0,0,0,{"$f":"'Jan-Abr 2025'!BH17","v":0},{"$f":"'Jan-Abr 2025'!BG17+'Mai-Ago 2025'!BG17+'Set-Dez 2025'!BG17+'Jan-Abr 2026'!BG17+'Mai-Ago 2026'!BG17","v":0},{"$nulls":3},0,0,0,null,0,0,0,0,0,{"$f":"'Jan-Abr 2025'!BV17","v":0},{"$f":"'Jan-Abr 2025'!BU17+'Mai-Ago 2025'!BU17+'Set-Dez 2025'!BU17+'Jan-Abr 2026'!BU17+'Mai-Ago 2026'!BU17","v":0}]
["16h50 - 17h40",{"$nulls":34},"IME",0,0,0,50,0,0,0,0,0,{"$f":"'Jan-Abr 2025'!AT18","v":0},{"$f":"'Jan-Abr 2025'!AS18+'Mai-Ago 2025'!AS18+'Set-Dez 2025'!AS18+'Jan-Abr 2026'!AS18+'Mai-Ago 2026'!AS18","v":0},{"$nulls":3},0,0,0,null,0,0,0,0,0,{"$f":"'Jan-Abr 2025'!BH18","v":0},{"$f":"'Jan-Abr 2025'!BG18+'Mai-Ago 2025'!BG18+'Set-Dez 2025'!BG18+'Jan-Abr 2026'!BG18+'Mai-Ago 2026'!BG18","v":0},{"$nulls":3},0,0,0,null,0,0,0,0,0,{"$f":"'Jan-Abr 2025'!BV18","v":0},{"$f":"'Jan-Abr 2025'!BU18+'Mai-Ago 2025'!BU18+'Set-Dez 2025'!BU18+'Jan-Abr 2026'!BU18+'Mai-Ago 2026'!BU18","v":0}]
[{"$nulls":35},"ELE",0,0,0,50,0,0,0,0,0,{"$f":"'Jan-Abr 2025'!AT19","v":0},{"$f":"'Jan-Abr 2025'!AS19+'Mai-Ago 2025'!AS19+'Set-Dez 2025'!AS19+'Jan-Abr 2026'!AS19+'Mai-Ago 2026'!AS19","v":0},{"$nulls":3},0,0,0,null,0,0,0,0,0,{"$f":"'Jan-Abr 2025'!BH19","v":0},{"$f":"'Jan-Abr 2025'!BG19+'Mai-Ago 2025'!BG19+'Set-Dez 2025'!BG19+'Jan-Abr 2026'!BG19+'Mai-Ago 2026'!BG19","v":0},{"$nulls":3},0,0,0,null,0,0,0,0,0,{"$f":"'Jan-Abr 2025'!BV19","v":0},{"$f":"'Jan-Abr 2025'!BU19+'Mai-Ago 2025'!BU19+'Set-Dez 2025'!BU19+'Jan-Abr 2026'!BU19+'Mai-Ago 2026'!BU19","v":0}]
[{"$f":"A8+DAY(EOMONTH(A8,0))","v":"2026-06-01"},null,{"$f":"IF(C21<>\"\",CHOOSE(WEEKDAY(C21,1),\"Dom.\",\"Seg.\",\"Ter.\",\"Qua.\",\"Qui.\",\"Sex.\",\"Sáb.\"),\"\")","v":"Seg."},{"$f":"IF(D21<>\"\",CHOOSE(WEEKDAY(D21,1),\"Dom.\",\"Seg.\",\"Ter.\",\"Qua.\",\"Qui.\",\"Sex.\",\"Sáb.\"),\"\")","v":"Ter."},"Qua.","Qui.","Sex.","Sáb.","Dom.","Seg.","Ter.","Qua.","Qui.","Sex.","Sáb.","Dom.","Seg.","Ter.","Qua.","Qui.","Sex.","Sáb.","Dom.","Seg.","Ter.","Qua.","Qui.","Sex.","Sáb.","Dom.","Seg.","Ter.","",null,null,"CP",0,0,0,25,0,0,0,0,0,{"$f":"'Jan-Abr 2025'!AT20","v":0},{"$f":"'Jan-Abr 2025'!AS20+'Mai-Ago 2025'!AS20+'Set-Dez 2025'!AS20+'Jan-Abr 2026'!AS20+'Mai-Ago 2026'!AS20","v":0},{"$nulls":3},0,0,0,null,0,0,0,0,0,{"$f":"'Jan-Abr 2025'!BH20","v":0},{"$f":"'Jan-Abr 2025'!BG20+'Mai-Ago 2025'!BG20+'Set-Dez 2025'!BG20+'Jan-Abr 2026'!BG20+'Mai-Ago 2026'!BG20","v":0},{"$nulls":3},0,0,0,null,0,0,0,0,0,{"$f":"'Jan-Abr 2025'!BV20","v":0},{"$f":"'Jan-Abr 2025'!BU20+'Mai-Ago 2025'!BU20+'Set-Dez 2025'!BU20+'Jan-Abr 2026'!BU20+'Mai-Ago 2026'!BU20","v":0}]
[null,null,{"$f":"A20","v":"2026-06-01"},{"$f":"IF(C21=\"\",\"\",IF(DAY(C21)<DAY(EOMONTH(C21,0)),C21+1,\"\"))","v":"2026-06-02"},"2026-06-03","2026-06-04","2026-06-05","2026-06-06","2026-06-07","2026-06-08","2026-06-09","2026-06-10","2026-06-11","2026-06-12","2026-06-13","2026-06-14","2026-06-15","2026-06-16","2026-06-17","2026-06-18","2026-06-19","2026-06-20","2026-06-21","2026-06-22","2026-06-23","2026-06-24","2026-06-25","2026-06-26","2026-06-27","2026-06-28","2026-06-29","2026-06-30","",null,null,"CH",0,0,0,25,0,0,0,0,0,{"$f":"'Jan-Abr 2025'!AT21","v":0},{"$f":"'Jan-Abr 2025'!AS21+'Mai-Ago 2025'!AS21+'Set-Dez 2025'!AS21+'Jan-Abr 2026'!AS21+'Mai-Ago 2026'!AS21","v":0},{"$nulls":3},0,0,0,null,0,0,0,0,0,{"$f":"'Jan-Abr 2025'!BH21","v":0},{"$f":"'Jan-Abr 2025'!BG21+'Mai-Ago 2025'!BG21+'Set-Dez 2025'!BG21+'Jan-Abr 2026'!BG21+'Mai-Ago 2026'!BG21","v":0},{"$nulls":3},0,0,0,null,0,0,0,0,0,{"$f":"'Jan-Abr 2025'!BV21","v":0},{"$f":"'Jan-Abr 2025'!BU21+'Mai-Ago 2025'!BU21+'Set-Dez 2025'!BU21+'Jan-Abr 2026'!BU21+'Mai-Ago 2026'!BU21","v":0}]
[{"$f":"A10","v":"09h00 - 09h50"},{"$nulls":4},"Corpo",{"$nulls":5},"Dia",{"$nulls":23},"CLP",0,0,0,50,0,0,0,0,0,{"$f":"'Jan-Abr 2025'!AT22","v":0},{"$f":"'Jan-Abr 2025'!AS22+'Mai-Ago 2025'!AS22+'Set-Dez 2025'!AS22+'Jan-Abr 2026'!AS22+'Mai-Ago 2026'!AS22","v":0},{"$nulls":3},0,0,0,null,0,0,0,0,0,{"$f":"'Jan-Abr 2025'!BH22","v":0},{"$f":"'Jan-Abr 2025'!BG22+'Mai-Ago 2025'!BG22+'Set-Dez 2025'!BG22+'Jan-Abr 2026'!BG22+'Mai-Ago 2026'!BG22","v":0},{"$nulls":3},0,0,0,null,0,0,0,0,0,{"$f":"'Jan-Abr 2025'!BV22","v":0},{"$f":"'Jan-Abr 2025'!BU22+'Mai-Ago 2025'!BU22+'Set-Dez 2025'!BU22+'Jan-Abr 2026'!BU22+'Mai-Ago 2026'!BU22","v":0}]
[{"$f":"A11","v":"09h50 - 10h40"},{"$nulls":4},"de",{"$nulls":5},"de",{"$nulls":23},"DCM",0,0,0,50,0,0,0,0,0,{"$f":"'Jan-Abr 2025'!AT23","v":0},{"$f":"'Jan-Abr 2025'!AS23+'Mai-Ago 2025'!AS23+'Set-Dez 2025'!AS23+'Jan-Abr 2026'!AS23+'Mai-Ago 2026'!AS23","v":0},{"$nulls":3},0,0,0,null,0,0,0,0,0,{"$f":"'Jan-Abr 2025'!BH23","v":0},{"$f":"'Jan-Abr 2025'!BG23+'Mai-Ago 2025'!BG23+'Set-Dez 2025'!BG23+'Jan-Abr 2026'!BG23+'Mai-Ago 2026'!BG23","v":0},{"$nulls":3},0,0,0,null,0,0,0,0,0,{"$f":"'Jan-Abr 2025'!BV23","v":0},{"$f":"'Jan-Abr 2025'!BU23+'Mai-Ago 2025'!BU23+'Set-Dez 2025'!BU23+'Jan-Abr 2026'!BU23+'Mai-Ago 2026'!BU23","v":0}]
["11h00 - 11h50",{"$nulls":4},"Deus",{"$nulls":5},"Port.",{"$nulls":23},"CM",0,0,0,50,0,0,0,0,0,{"$f":"'Jan-Abr 2025'!AT24","v":0},{"$f":"'Jan-Abr 2025'!AS24+'Mai-Ago 2025'!AS24+'Set-Dez 2025'!AS24+'Jan-Abr 2026'!AS24+'Mai-Ago 2026'!AS24","v":0},{"$nulls":3},0,0,0,null,0,0,0,0,0,{"$f":"'Jan-Abr 2025'!BH24","v":0},{"$f":"'Jan-Abr 2025'!BG24+'Mai-Ago 2025'!BG24+'Set-Dez 2025'!BG24+'Jan-Abr 2026'!BG24+'Mai-Ago 2026'!BG24","v":0},{"$nulls":3},0,0,0,null,0,0,0,0,0,{"$f":"'Jan-Abr 2025'!BV24","v":0},{"$f":"'Jan-Abr 2025'!BU24+'Mai-Ago 2025'!BU24+'Set-Dez 2025'!BU24+'Jan-Abr 2026'!BU24+'Mai-Ago 2026'!BU24","v":0}]
["11h50 - 12h40",{"$nulls":34},"SD",0,0,0,50,0,0,0,0,0,{"$f":"'Jan-Abr 2025'!AT25","v":0},{"$f":"'Jan-Abr 2025'!AS25+'Mai-Ago 2025'!AS25+'Set-Dez 2025'!AS25+'Jan-Abr 2026'!AS25+'Mai-Ago 2026'!AS25","v":0},{"$nulls":3},0,0,0,null,0,0,0,0,0,{"$f":"'Jan-Abr 2025'!BH25","v":0},{"$f":"'Jan-Abr 2025'!BG25+'Mai-Ago 2025'!BG25+'Set-Dez 2025'!BG25+'Jan-Abr 2026'!BG25+'Mai-Ago 2026'!BG25","v":0},{"$nulls":3},0,0,0,null,0,0,0,0,0,{"$f":"'Jan-Abr 2025'!BV25","v":0},{"$f":"'Jan-Abr 2025'!BU25+'Mai-Ago 2025'!BU25+'Set-Dez 2025'!BU25+'Jan-Abr 2026'!BU25+'Mai-Ago 2026'!BU25","v":0}]
[{"$nulls":35},"OEM",0,0,0,50,0,0,0,0,0,{"$f":"'Jan-Abr 2025'!AT26","v":0},{"$f":"'Jan-Abr 2025'!AS26+'Mai-Ago 2025'!AS26+'Set-Dez 2025'!AS26+'Jan-Abr 2026'!AS26+'Mai-Ago 2026'!AS26","v":0},{"$nulls":3},0,0,0,null,0,0,0,0,0,{"$f":"'Jan-Abr 2025'!BH26","v":0},{"$f":"'Jan-Abr 2025'!BG26+'Mai-Ago 2025'!BG26+'Set-Dez 2025'!BG26+'Jan-Abr 2026'!BG26+'Mai-Ago 2026'!BG26","v":0},{"$nulls":3},0,0,0,null,0,0,0,0,0,{"$f":"'Jan-Abr 2025'!BV26","v":0},{"$f":"'Jan-Abr 2025'!BU26+'Mai-Ago 2025'!BU26+'Set-Dez 2025'!BU26+'Jan-Abr 2026'!BU26+'Mai-Ago 2026'!BU26","v":0}]
["14h00 - 14h50",{"$nulls":34},"GP",0,0,0,50,0,0,0,0,0,{"$f":"'Jan-Abr 2025'!AT27","v":0},{"$f":"'Jan-Abr 2025'!AS27+'Mai-Ago 2025'!AS27+'Set-Dez 2025'!AS27+'Jan-Abr 2026'!AS27+'Mai-Ago 2026'!AS27","v":0},{"$nulls":3},0,0,0,null,0,0,0,0,0,{"$f":"'Jan-Abr 2025'!BH27","v":0},{"$f":"'Jan-Abr 2025'!BG27+'Mai-Ago 2025'!BG27+'Set-Dez 2025'!BG27+'Jan-Abr 2026'!BG27+'Mai-Ago 2026'!BG27","v":0},{"$nulls":3},0,0,0,null,0,0,0,0,0,{"$f":"'Jan-Abr 2025'!BV27","v":0},{"$f":"'Jan-Abr 2025'!BU27+'Mai-Ago 2025'!BU27+'Set-Dez 2025'!BU27+'Jan-Abr 2026'!BU27+'Mai-Ago 2026'!BU27","v":0}]
["14h50 - 15h40",{"$nulls":34},"PP",0,0,0,50,0,0,0,0,0,{"$f":"'Jan-Abr 2025'!AT28","v":0},{"$f":"'Jan-Abr 2025'!AS28+'Mai-Ago 2025'!AS28+'Set-Dez 2025'!AS28+'Jan-Abr 2026'!AS28+'Mai-Ago 2026'!AS28","v":0},{"$nulls":3},0,0,0,null,0,0,0,0,0,{"$f":"'Jan-Abr 2025'!BH28","v":0},{"$f":"'Jan-Abr 2025'!BG28+'Mai-Ago 2025'!BG28+'Set-Dez 2025'!BG28+'Jan-Abr 2026'!BG28+'Mai-Ago 2026'!BG28","v":0},{"$nulls":3},0,0,0,null,0,0,0,0,0,{"$f":"'Jan-Abr 2025'!BV28","v":0},{"$f":"'Jan-Abr 2025'!BU28+'Mai-Ago 2025'!BU28+'Set-Dez 2025'!BU28+'Jan-Abr 2026'!BU28+'Mai-Ago 2026'!BU28","v":0}]
["16h00 - 16h50",{"$nulls":34},"GS",0,0,0,50,0,0,0,0,0,{"$f":"'Jan-Abr 2025'!AT29","v":0},{"$f":"'Jan-Abr 2025'!AS29+'Mai-Ago 2025'!AS29+'Set-Dez 2025'!AS29+'Jan-Abr 2026'!AS29+'Mai-Ago 2026'!AS29","v":0},{"$nulls":3},0,0,0,null,0,0,0,0,0,{"$f":"'Jan-Abr 2025'!BH29","v":0},{"$f":"'Jan-Abr 2025'!BG29+'Mai-Ago 2025'!BG29+'Set-Dez 2025'!BG29+'Jan-Abr 2026'!BG29+'Mai-Ago 2026'!BG29","v":0},{"$nulls":3},0,0,0,null,0,0,0,0,0,{"$f":"'Jan-Abr 2025'!BV29","v":0},{"$f":"'Jan-Abr 2025'!BU29+'Mai-Ago 2025'!BU29+'Set-Dez 2025'!BU29+'Jan-Abr 2026'!BU29+'Mai-Ago 2026'!BU29","v":0}]
["16h50 - 17h40",{"$nulls":34},"CGO",0,0,0,50,0,0,0,0,0,{"$f":"'Jan-Abr 2025'!AT30","v":0},{"$f":"'Jan-Abr 2025'!AS30+'Mai-Ago 2025'!AS30+'Set-Dez 2025'!AS30+'Jan-Abr 2026'!AS30+'Mai-Ago 2026'!AS30","v":0},{"$nulls":3},0,0,0,null,0,0,0,0,0,{"$f":"'Jan-Abr 2025'!BH30","v":0},{"$f":"'Jan-Abr 2025'!BG30+'Mai-Ago 2025'!BG30+'Set-Dez 2025'!BG30+'Jan-Abr 2026'!BG30+'Mai-Ago 2026'!BG30","v":0},{"$nulls":3},0,0,0,null,0,0,0,0,0,{"$f":"'Jan-Abr 2025'!BV30","v":0},{"$f":"'Jan-Abr 2025'!BU30+'Mai-Ago 2025'!BU30+'Set-Dez 2025'!BU30+'Jan-Abr 2026'!BU30+'Mai-Ago 2026'!BU30","v":0}]
[{"$nulls":35},"LOG",0,0,0,50,0,0,0,0,0,{"$f":"'Jan-Abr 2025'!AT31","v":0},{"$f":"'Jan-Abr 2025'!AS31+'Mai-Ago 2025'!AS31+'Set-Dez 2025'!AS31+'Jan-Abr 2026'!AS31+'Mai-Ago 2026'!AS31","v":0},{"$nulls":3},0,0,0,null,0,0,0,0,0,{"$f":"'Jan-Abr 2025'!BH31","v":0},{"$f":"'Jan-Abr 2025'!BG31+'Mai-Ago 2025'!BG31+'Set-Dez 2025'!BG31+'Jan-Abr 2026'!BG31+'Mai-Ago 2026'!BG31","v":0},{"$nulls":3},0,0,0,null,0,0,0,0,0,{"$f":"'Jan-Abr 2025'!BV31","v":0},{"$f":"'Jan-Abr 2025'!BU31+'Mai-Ago 2025'!BU31+'Set-Dez 2025'!BU31+'Jan-Abr 2026'!BU31+'Mai-Ago 2026'!BU31","v":0}]
[{"$f":"A20+DAY(EOMONTH(A20,0))","v":"2026-07-01"},null,{"$f":"IF(C33<>\"\",CHOOSE(WEEKDAY(C33,1),\"Dom.\",\"Seg.\",\"Ter.\",\"Qua.\",\"Qui.\",\"Sex.\",\"Sáb.\"),\"\")","v":"Qua."},{"$f":"IF(D33<>\"\",CHOOSE(WEEKDAY(D33,1),\"Dom.\",\"Seg.\",\"Ter.\",\"Qua.\",\"Qui.\",\"Sex.\",\"Sáb.\"),\"\")","v":"Qui."},"Sex.","Sáb.","Dom.","Seg.","Ter.","Qua.","Qui.","Sex.","Sáb.","Dom.","Seg.","Ter.","Qua.","Qui.","Sex.","Sáb.","Dom.","Seg.","Ter.","Qua.","Qui.","Sex.","Sáb.","Dom.","Seg.","Ter.","Qua.","Qui.","Sex.",null,null,"MOT",0,0,0,50,0,0,0,0,0,{"$f":"'Jan-Abr 2025'!AT32","v":0},{"$f":"'Jan-Abr 2025'!AS32+'Mai-Ago 2025'!AS32+'Set-Dez 2025'!AS32+'Jan-Abr 2026'!AS32+'Mai-Ago 2026'!AS32","v":0},{"$nulls":3},0,0,0,null,0,0,0,0,0,{"$f":"'Jan-Abr 2025'!BH32","v":0},{"$f":"'Jan-Abr 2025'!BG32+'Mai-Ago 2025'!BG32+'Set-Dez 2025'!BG32+'Jan-Abr 2026'!BG32+'Mai-Ago 2026'!BG32","v":0},{"$nulls":3},0,0,0,null,0,0,0,0,0,{"$f":"'Jan-Abr 2025'!BV32","v":0},{"$f":"'Jan-Abr 2025'!BU32+'Mai-Ago 2025'!BU32+'Set-Dez 2025'!BU32+'Jan-Abr 2026'!BU32+'Mai-Ago 2026'!BU32","v":0}]
[null,null,{"$f":"A32","v":"2026-07-01"},{"$f":"IF(C33=\"\",\"\",IF(DAY(C33)<DAY(EOMONTH(C33,0)),C33+1,\"\"))","v":"2026-07-02"},"2026-07-03","2026-07-04","2026-07-05","2026-07-06","2026-07-07","2026-07-08","2026-07-09","2026-07-10","2026-07-11","2026-07-12","2026-07-13","2026-07-14","2026-07-15","2026-07-16","2026-07-17","2026-07-18","2026-07-19","2026-07-20","2026-07-21","2026-07-22","2026-07-23","2026-07-24","2026-07-25","2026-07-26","2026-07-27","2026-07-28","2026-07-29","2026-07-30","2026-07-31",null,null,"SGI",0,0,0,25,0,0,0,0,0,{"$f":"'Jan-Abr 2025'!AT33","v":0},{"$f":"'Jan-Abr 2025'!AS33+'Mai-Ago 2025'!AS33+'Set-Dez 2025'!AS33+'Jan-Abr 2026'!AS33+'Mai-Ago 2026'!AS33","v":0},{"$nulls":3},0,0,0,null,0,0,0,0,0,{"$f":"'Jan-Abr 2025'!BH33","v":0},{"$f":"'Jan-Abr 2025'!BG33+'Mai-Ago 2025'!BG33+'Set-Dez 2025'!BG33+'Jan-Abr 2026'!BG33+'Mai-Ago 2026'!BG33","v":0},{"$nulls":3},0,0,0,null,0,0,0,0,0,{"$f":"'Jan-Abr 2025'!BV33","v":0},{"$f":"'Jan-Abr 2025'!BU33+'Mai-Ago 2025'!BU33+'Set-Dez 2025'!BU33+'Jan-Abr 2026'!BU33+'Mai-Ago 2026'!BU33","v":0}]
[{"$f":"A22","v":"09h00 - 09h50"},{"$nulls":34},"QCEP",0,0,0,50,0,0,0,0,0,{"$f":"'Jan-Abr 2025'!AT34","v":0},{"$f":"'Jan-Abr 2025'!AS34+'Mai-Ago 2025'!AS34+'Set-Dez 2025'!AS34+'Jan-Abr 2026'!AS34+'Mai-Ago 2026'!AS34","v":0},{"$nulls":3},0,0,0,null,0,0,0,0,0,{"$f":"'Jan-Abr 2025'!BH34","v":0},{"$f":"'Jan-Abr 2025'!BG34+'Mai-Ago 2025'!BG34+'Set-Dez 2025'!BG34+'Jan-Abr 2026'!BG34+'Mai-Ago 2026'!BG34","v":0},{"$nulls":3},0,0,0,null,0,0,0,0,0,{"$f":"'Jan-Abr 2025'!BV34","v":0},{"$f":"'Jan-Abr 2025'!BU34+'Mai-Ago 2025'!BU34+'Set-Dez 2025'!BU34+'Jan-Abr 2026'!BU34+'Mai-Ago 2026'!BU34","v":0}]
[{"$f":"A23","v":"09h50 - 10h40"},{"$nulls":35},0,0,0,null,0,0,0,0,0,{"$f":"'Jan-Abr 2025'!AT35","v":0},{"$f":"'Jan-Abr 2025'!AS35+'Mai-Ago 2025'!AS35+'Set-Dez 2025'!AS35+'Jan-Abr 2026'!AS35+'Mai-Ago 2026'!AS35","v":0},{"$nulls":3},0,0,0,null,0,0,0,0,0,{"$f":"'Jan-Abr 2025'!BH35","v":0},{"$f":"'Jan-Abr 2025'!BG35+'Mai-Ago 2025'!BG35+'Set-Dez 2025'!BG35+'Jan-Abr 2026'!BG35+'Mai-Ago 2026'!BG35","v":0},{"$nulls":3},0,0,0,null,0,0,0,0,0,{"$f":"'Jan-Abr 2025'!BV35","v":0},{"$f":"'Jan-Abr 2025'!BU35+'Mai-Ago 2025'!BU35+'Set-Dez 2025'!BU35+'Jan-Abr 2026'!BU35+'Mai-Ago 2026'!BU35","v":0}]
["11h00 - 11h50",{"$nulls":35},0,0,0,null,0,0,0,0,0,{"$f":"'Jan-Abr 2025'!AT36","v":0},{"$f":"'Jan-Abr 2025'!AS36+'Mai-Ago 2025'!AS36+'Set-Dez 2025'!AS36+'Jan-Abr 2026'!AS36+'Mai-Ago 2026'!AS36","v":0},{"$nulls":3},0,0,0,null,0,0,0,0,0,{"$f":"'Jan-Abr 2025'!BH36","v":0},{"$f":"'Jan-Abr 2025'!BG36+'Mai-Ago 2025'!BG36+'Set-Dez 2025'!BG36+'Jan-Abr 2026'!BG36+'Mai-Ago 2026'!BG36","v":0},{"$nulls":3},0,0,0,null,0,0,0,0,0,{"$f":"'Jan-Abr 2025'!BV36","v":0},{"$f":"'Jan-Abr 2025'!BU36+'Mai-Ago 2025'!BU36+'Set-Dez 2025'!BU36+'Jan-Abr 2026'!BU36+'Mai-Ago 2026'!BU36","v":0}]
["11h50 - 12h40",{"$nulls":35},0,0,0,null,0,0,0,0,0,{"$f":"'Jan-Abr 2025'!AT37","v":0},{"$f":"'Jan-Abr 2025'!AS37+'Mai-Ago 2025'!AS37+'Set-Dez 2025'!AS37+'Jan-Abr 2026'!AS37+'Mai-Ago 2026'!AS37","v":0},{"$nulls":3},0,0,0,null,0,0,0,0,0,{"$f":"'Jan-Abr 2025'!BH37","v":0},{"$f":"'Jan-Abr 2025'!BG37+'Mai-Ago 2025'!BG37+'Set-Dez 2025'!BG37+'Jan-Abr 2026'!BG37+'Mai-Ago 2026'!BG37","v":0},{"$nulls":3},0,0,0,null,0,0,0,0,0,{"$f":"'Jan-Abr 2025'!BV37","v":0},{"$f":"'Jan-Abr 2025'!BU37+'Mai-Ago 2025'!BU37+'Set-Dez 2025'!BU37+'Jan-Abr 2026'!BU37+'Mai-Ago 2026'!BU37","v":0}]
[{"$nulls":36},0,0,0,null,0,0,0,0,0,{"$f":"'Jan-Abr 2025'!AT38","v":0},{"$f":"'Jan-Abr 2025'!AS38+'Mai-Ago 2025'!AS38+'Set-Dez 2025'!AS38+'Jan-Abr 2026'!AS38+'Mai-Ago 2026'!AS38","v":0},{"$nulls":3},0,0,0,null,0,0,0,0,0,{"$f":"'Jan-Abr 2025'!BH38","v":0},{"$f":"'Jan-Abr 2025'!BG38+'Mai-Ago 2025'!BG38+'Set-Dez 2025'!BG38+'Jan-Abr 2026'!BG38+'Mai-Ago 2026'!BG38","v":0},{"$nulls":3},0,0,0,null,0,0,0,0,0,{"$f":"'Jan-Abr 2025'!BV38","v":0},{"$f":"'Jan-Abr 2025'!BU38+'Mai-Ago 2025'!BU38+'Set-Dez 2025'!BU38+'Jan-Abr 2026'!BU38+'Mai-Ago 2026'!BU38","v":0}]
["14h00 - 14h50",{"$nulls":35},0,0,0,null,0,0,0,0,0,{"$f":"'Jan-Abr 2025'!AT39","v":0},{"$f":"'Jan-Abr 2025'!AS39+'Mai-Ago 2025'!AS39+'Set-Dez 2025'!AS39+'Jan-Abr 2026'!AS39+'Mai-Ago 2026'!AS39","v":0},{"$nulls":3},0,0,0,null,0,0,0,0,0,{"$f":"'Jan-Abr 2025'!BH39","v":0},{"$f":"'Jan-Abr 2025'!BG39+'Mai-Ago 2025'!BG39+'Set-Dez 2025'!BG39+'Jan-Abr 2026'!BG39+'Mai-Ago 2026'!BG39","v":0},{"$nulls":3},0,0,0,null,0,0,0,0,0,{"$f":"'Jan-Abr 2025'!BV39","v":0},{"$f":"'Jan-Abr 2025'!BU39+'Mai-Ago 2025'!BU39+'Set-Dez 2025'!BU39+'Jan-Abr 2026'!BU39+'Mai-Ago 2026'!BU39","v":0}]
["14h50 - 15h40",{"$nulls":35},0,0,0,null,0,0,0,0,{"$f":"SUM(AO40:AR40)","v":0},{"$f":"'Jan-Abr 2025'!AT40","v":0},{"$f":"'Jan-Abr 2025'!AS40+'Mai-Ago 2025'!AS40+'Set-Dez 2025'!AS40+'Jan-Abr 2026'!AS40+'Mai-Ago 2026'!AS40","v":0},{"$nulls":3},0,0,0,null,0,0,0,0,0,{"$f":"'Jan-Abr 2025'!BH40","v":0},{"$f":"'Jan-Abr 2025'!BG40+'Mai-Ago 2025'!BG40+'Set-Dez 2025'!BG40+'Jan-Abr 2026'!BG40+'Mai-Ago 2026'!BG40","v":0},{"$nulls":3},0,0,0,null,0,0,0,0,{"$f":"SUM(BQ40:BT40)","v":0},{"$f":"'Jan-Abr 2025'!BV40","v":0},{"$f":"'Jan-Abr 2025'!BU40+'Mai-Ago 2025'!BU40+'Set-Dez 2025'!BU40+'Jan-Abr 2026'!BU40+'Mai-Ago 2026'!BU40","v":0}]
["16h00 - 16h50",{"$nulls":35},0,0,0,null,0,0,0,0,0,{"$f":"'Jan-Abr 2025'!AT41","v":0},{"$f":"'Jan-Abr 2025'!AS41+'Mai-Ago 2025'!AS41+'Set-Dez 2025'!AS41+'Jan-Abr 2026'!AS41+'Mai-Ago 2026'!AS41","v":0},{"$nulls":3},0,0,0,null,0,0,0,0,0,{"$f":"'Jan-Abr 2025'!BH41","v":0},{"$f":"'Jan-Abr 2025'!BG41+'Mai-Ago 2025'!BG41+'Set-Dez 2025'!BG41+'Jan-Abr 2026'!BG41+'Mai-Ago 2026'!BG41","v":0},{"$nulls":3},0,0,0,null,0,0,0,0,0,{"$f":"'Jan-Abr 2025'!BV41","v":0},{"$f":"'Jan-Abr 2025'!BU41+'Mai-Ago 2025'!BU41+'Set-Dez 2025'!BU41+'Jan-Abr 2026'!BU41+'Mai-Ago 2026'!BU41","v":0}]
["16h50 - 17h40",{"$nulls":35},0,0,0,null,0,0,0,0,0,{"$f":"'Jan-Abr 2025'!AT42","v":0},{"$f":"'Jan-Abr 2025'!AS42+'Mai-Ago 2025'!AS42+'Set-Dez 2025'!AS42+'Jan-Abr 2026'!AS42+'Mai-Ago 2026'!AS42","v":0},{"$nulls":3},0,0,0,null,0,0,0,0,0,{"$f":"'Jan-Abr 2025'!BH42","v":0},{"$f":"'Jan-Abr 2025'!BG42+'Mai-Ago 2025'!BG42+'Set-Dez 2025'!BG42+'Jan-Abr 2026'!BG42+'Mai-Ago 2026'!BG42","v":0},{"$nulls":3},0,0,0,null,0,0,0,0,0,{"$f":"'Jan-Abr 2025'!BV42","v":0},{"$f":"'Jan-Abr 2025'!BU42+'Mai-Ago 2025'!BU42+'Set-Dez 2025'!BU42+'Jan-Abr 2026'!BU42+'Mai-Ago 2026'!BU42","v":0}]
[{"$nulls":36},0,0,0,null,0,0,0,0,0,{"$f":"'Jan-Abr 2025'!AT43","v":0},{"$f":"'Jan-Abr 2025'!AS43+'Mai-Ago 2025'!AS43+'Set-Dez 2025'!AS43+'Jan-Abr 2026'!AS43+'Mai-Ago 2026'!AS43","v":0},{"$nulls":3},0,0,0,null,0,0,0,0,0,{"$f":"'Jan-Abr 2025'!BH43","v":0},{"$f":"'Jan-Abr 2025'!BG43+'Mai-Ago 2025'!BG43+'Set-Dez 2025'!BG43+'Jan-Abr 2026'!BG43+'Mai-Ago 2026'!BG43","v":0},{"$nulls":3},0,0,0,null,0,0,0,0,0,{"$f":"'Jan-Abr 2025'!BV43","v":0},{"$f":"'Jan-Abr 2025'!BU43+'Mai-Ago 2025'!BU43+'Set-Dez 2025'!BU43+'Jan-Abr 2026'!BU43+'Mai-Ago 2026'!BU43","v":0}]
[{"$f":"A32+DAY(EOMONTH(A32,0))","v":"2026-08-01"},null,{"$f":"IF(C45<>\"\",CHOOSE(WEEKDAY(C45,1),\"Dom.\",\"Seg.\",\"Ter.\",\"Qua.\",\"Qui.\",\"Sex.\",\"Sáb.\"),\"\")","v":"Sáb."},{"$f":"IF(D45<>\"\",CHOOSE(WEEKDAY(D45,1),\"Dom.\",\"Seg.\",\"Ter.\",\"Qua.\",\"Qui.\",\"Sex.\",\"Sáb.\"),\"\")","v":"Dom."},"Seg.","Ter.","Qua.","Qui.","Sex.","Sáb.","Dom.","Seg.","Ter.","Qua.","Qui.","Sex.","Sáb.","Dom.","Seg.","Ter.","Qua.","Qui.","Sex.","Sáb.","Dom.","Seg.","Ter.","Qua.","Qui.","Sex.","Sáb.","Dom.","Seg.",{"$nulls":3},0,0,0,null,0,0,0,0,0,{"$f":"'Jan-Abr 2025'!AT44","v":0},{"$f":"'Jan-Abr 2025'!AS44+'Mai-Ago 2025'!AS44+'Set-Dez 2025'!AS44+'Jan-Abr 2026'!AS44+'Mai-Ago 2026'!AS44","v":0},{"$nulls":3},0,0,0,null,0,0,0,0,0,{"$f":"'Jan-Abr 2025'!BH44","v":0},{"$f":"'Jan-Abr 2025'!BG44+'Mai-Ago 2025'!BG44+'Set-Dez 2025'!BG44+'Jan-Abr 2026'!BG44+'Mai-Ago 2026'!BG44","v":0},{"$nulls":3},0,0,0,null,0,0,0,0,0,{"$f":"'Jan-Abr 2025'!BV44","v":0},{"$f":"'Jan-Abr 2025'!BU44+'Mai-Ago 2025'!BU44+'Set-Dez 2025'!BU44+'Jan-Abr 2026'!BU44+'Mai-Ago 2026'!BU44","v":0}]
[null,null,{"$f":"A44","v":"2026-08-01"},{"$f":"IF(C45=\"\",\"\",IF(DAY(C45)<DAY(EOMONTH(C45,0)),C45+1,\"\"))","v":"2026-08-02"},"2026-08-03","2026-08-04","2026-08-05","2026-08-06","2026-08-07","2026-08-08","2026-08-09","2026-08-10","2026-08-11","2026-08-12","2026-08-13","2026-08-14","2026-08-15","2026-08-16","2026-08-17","2026-08-18","2026-08-19","2026-08-20","2026-08-21","2026-08-22","2026-08-23","2026-08-24","2026-08-25","2026-08-26","2026-08-27","2026-08-28","2026-08-29","2026-08-30","2026-08-31",{"$nulls":3},0,0,0,null,0,0,0,0,0,{"$f":"'Jan-Abr 2025'!AT45","v":0},{"$f":"'Jan-Abr 2025'!AS45+'Mai-Ago 2025'!AS45+'Set-Dez 2025'!AS45+'Jan-Abr 2026'!AS45+'Mai-Ago 2026'!AS45","v":0},{"$nulls":3},0,0,0,null,0,0,0,0,0,{"$f":"'Jan-Abr 2025'!BH45","v":0},{"$f":"'Jan-Abr 2025'!BG45+'Mai-Ago 2025'!BG45+'Set-Dez 2025'!BG45+'Jan-Abr 2026'!BG45+'Mai-Ago 2026'!BG45","v":0},{"$nulls":3},0,0,0,null,0,0,0,0,0,{"$f":"'Jan-Abr 2025'!BV45","v":0},{"$f":"'Jan-Abr 2025'!BU45+'Mai-Ago 2025'!BU45+'Set-Dez 2025'!BU45+'Jan-Abr 2026'!BU45+'Mai-Ago 2026'!BU45","v":0}]
[{"$f":"A10","v":"09h00 - 09h50"},{"$nulls":15},"Assunção",{"$nulls":19},0,0,0,null,0,0,0,0,0,{"$f":"'Jan-Abr 2025'!AT46","v":0},{"$f":"'Jan-Abr 2025'!AS46+'Mai-Ago 2025'!AS46+'Set-Dez 2025'!AS46+'Jan-Abr 2026'!AS46+'Mai-Ago 2026'!AS46","v":0},{"$nulls":3},0,0,0,null,0,0,0,0,0,{"$f":"'Jan-Abr 2025'!BH46","v":0},{"$f":"'Jan-Abr 2025'!BG46+'Mai-Ago 2025'!BG46+'Set-Dez 2025'!BG46+'Jan-Abr 2026'!BG46+'Mai-Ago 2026'!BG46","v":0},{"$nulls":3},0,0,0,null,0,0,0,0,0,{"$f":"'Jan-Abr 2025'!BV46","v":0},{"$f":"'Jan-Abr 2025'!BU46+'Mai-Ago 2025'!BU46+'Set-Dez 2025'!BU46+'Jan-Abr 2026'!BU46+'Mai-Ago 2026'!BU46","v":0}]
[{"$f":"A11","v":"09h50 - 10h40"},{"$nulls":15},"Nossa",{"$nulls":19},0,0,0,null,0,0,0,0,0,{"$f":"'Jan-Abr 2025'!AT47","v":0},{"$f":"'Jan-Abr 2025'!AS47+'Mai-Ago 2025'!AS47+'Set-Dez 2025'!AS47+'Jan-Abr 2026'!AS47+'Mai-Ago 2026'!AS47","v":0},{"$nulls":3},0,0,0,null,0,0,0,0,0,{"$f":"'Jan-Abr 2025'!BH47","v":0},{"$f":"'Jan-Abr 2025'!BG47+'Mai-Ago 2025'!BG47+'Set-Dez 2025'!BG47+'Jan-Abr 2026'!BG47+'Mai-Ago 2026'!BG47","v":0},{"$nulls":3},0,0,0,null,0,0,0,0,0,{"$f":"'Jan-Abr 2025'!BV47","v":0},{"$f":"'Jan-Abr 2025'!BU47+'Mai-Ago 2025'!BU47+'Set-Dez 2025'!BU47+'Jan-Abr 2026'!BU47+'Mai-Ago 2026'!BU47","v":0}]
["11h00 - 11h50",{"$nulls":15},"Senhora",{"$nulls":19},0,0,0,null,0,0,0,0,0,{"$f":"'Jan-Abr 2025'!AT48","v":0},{"$f":"'Jan-Abr 2025'!AS48+'Mai-Ago 2025'!AS48+'Set-Dez 2025'!AS48+'Jan-Abr 2026'!AS48+'Mai-Ago 2026'!AS48","v":0},{"$nulls":3},0,0,0,null,0,0,0,0,0,{"$f":"'Jan-Abr 2025'!BH48","v":0},{"$f":"'Jan-Abr 2025'!BG48+'Mai-Ago 2025'!BG48+'Set-Dez 2025'!BG48+'Jan-Abr 2026'!BG48+'Mai-Ago 2026'!BG48","v":0},{"$nulls":3},0,0,0,null,0,0,0,0,0,{"$f":"'Jan-Abr 2025'!BV48","v":0},{"$f":"'Jan-Abr 2025'!BU48+'Mai-Ago 2025'!BU48+'Set-Dez 2025'!BU48+'Jan-Abr 2026'!BU48+'Mai-Ago 2026'!BU48","v":0}]
["11h50 - 12h40",{"$nulls":35},0,0,0,null,0,0,0,0,0,{"$f":"'Jan-Abr 2025'!AT49","v":0},{"$f":"'Jan-Abr 2025'!AS49+'Mai-Ago 2025'!AS49+'Set-Dez 2025'!AS49+'Jan-Abr 2026'!AS49+'Mai-Ago 2026'!AS49","v":0},{"$nulls":3},0,0,0,null,0,0,0,0,0,{"$f":"'Jan-Abr 2025'!BH49","v":0},{"$f":"'Jan-Abr 2025'!BG49+'Mai-Ago 2025'!BG49+'Set-Dez 2025'!BG49+'Jan-Abr 2026'!BG49+'Mai-Ago 2026'!BG49","v":0},{"$nulls":3},0,0,0,null,0,0,0,0,0,{"$f":"'Jan-Abr 2025'!BV49","v":0},{"$f":"'Jan-Abr 2025'!BU49+'Mai-Ago 2025'!BU49+'Set-Dez 2025'!BU49+'Jan-Abr 2026'!BU49+'Mai-Ago 2026'!BU49","v":0}]
[{"$nulls":36},0,0,0,null,0,0,0,0,0,{"$f":"'Jan-Abr 2025'!AT50","v":0},{"$f":"'Jan-Abr 2025'!AS50+'Mai-Ago 2025'!AS50+'Set-Dez 2025'!AS50+'Jan-Abr 2026'!AS50+'Mai-Ago 2026'!AS50","v":0},{"$nulls":3},0,0,0,null,0,0,0,0,0,{"$f":"'Jan-Abr 2025'!BH50","v":0},{"$f":"'Jan-Abr 2025'!BG50+'Mai-Ago 2025'!BG50+'Set-Dez 2025'!BG50+'Jan-Abr 2026'!BG50+'Mai-Ago 2026'!BG50","v":0},{"$nulls":3},0,0,0,null,0,0,0,0,0,{"$f":"'Jan-Abr 2025'!BV50","v":0},{"$f":"'Jan-Abr 2025'!BU50+'Mai-Ago 2025'!BU50+'Set-Dez 2025'!BU50+'Jan-Abr 2026'!BU50+'Mai-Ago 2026'!BU50","v":0}]
["14h00 - 14h50",{"$nulls":35},0,0,0,null,0,0,0,0,0,{"$f":"'Jan-Abr 2025'!AT51","v":0},{"$f":"'Jan-Abr 2025'!AS51+'Mai-Ago 2025'!AS51+'Set-Dez 2025'!AS51+'Jan-Abr 2026'!AS51+'Mai-Ago 2026'!AS51","v":0},{"$nulls":3},0,0,0,null,0,0,0,0,0,{"$f":"'Jan-Abr 2025'!BH51","v":0},{"$f":"'Jan-Abr 2025'!BG51+'Mai-Ago 2025'!BG51+'Set-Dez 2025'!BG51+'Jan-Abr 2026'!BG51+'Mai-Ago 2026'!BG51","v":0},{"$nulls":3},0,0,0,null,0,0,0,0,0,{"$f":"'Jan-Abr 2025'!BV51","v":0},{"$f":"'Jan-Abr 2025'!BU51+'Mai-Ago 2025'!BU51+'Set-Dez 2025'!BU51+'Jan-Abr 2026'!BU51+'Mai-Ago 2026'!BU51","v":0}]
["14h50 - 15h40",{"$nulls":35},0,0,0,null,0,0,0,0,0,{"$f":"'Jan-Abr 2025'!AT52","v":0},{"$f":"'Jan-Abr 2025'!AS52+'Mai-Ago 2025'!AS52+'Set-Dez 2025'!AS52+'Jan-Abr 2026'!AS52+'Mai-Ago 2026'!AS52","v":0},{"$nulls":3},0,0,0,null,0,0,0,0,0,{"$f":"'Jan-Abr 2025'!BH52","v":0},{"$f":"'Jan-Abr 2025'!BG52+'Mai-Ago 2025'!BG52+'Set-Dez 2025'!BG52+'Jan-Abr 2026'!BG52+'Mai-Ago 2026'!BG52","v":0},{"$nulls":3},0,0,0,null,0,0,0,0,0,{"$f":"'Jan-Abr 2025'!BV52","v":0},{"$f":"'Jan-Abr 2025'!BU52+'Mai-Ago 2025'!BU52+'Set-Dez 2025'!BU52+'Jan-Abr 2026'!BU52+'Mai-Ago 2026'!BU52","v":0}]
["16h00 - 16h50",{"$nulls":35},0,0,0,null,0,0,0,0,0,{"$f":"'Jan-Abr 2025'!AT53","v":0},{"$f":"'Jan-Abr 2025'!AS53+'Mai-Ago 2025'!AS53+'Set-Dez 2025'!AS53+'Jan-Abr 2026'!AS53+'Mai-Ago 2026'!AS53","v":0},{"$nulls":3},0,0,0,null,0,0,0,0,0,{"$f":"'Jan-Abr 2025'!BH53","v":0},{"$f":"'Jan-Abr 2025'!BG53+'Mai-Ago 2025'!BG53+'Set-Dez 2025'!BG53+'Jan-Abr 2026'!BG53+'Mai-Ago 2026'!BG53","v":0},{"$nulls":3},0,0,0,null,0,0,0,0,0,{"$f":"'Jan-Abr 2025'!BV53","v":0},{"$f":"'Jan-Abr 2025'!BU53+'Mai-Ago 2025'!BU53+'Set-Dez 2025'!BU53+'Jan-Abr 2026'!BU53+'Mai-Ago 2026'!BU53","v":0}]
["16h50 - 17h40",{"$nulls":35},0,0,0,null,0,0,0,0,0,{"$f":"'Jan-Abr 2025'!AT54","v":0},{"$f":"'Jan-Abr 2025'!AS54+'Mai-Ago 2025'!AS54+'Set-Dez 2025'!AS54+'Jan-Abr 2026'!AS54+'Mai-Ago 2026'!AS54","v":0},{"$nulls":3},0,0,0,null,0,0,0,0,0,{"$f":"'Jan-Abr 2025'!BH54","v":0},{"$f":"'Jan-Abr 2025'!BG54+'Mai-Ago 2025'!BG54+'Set-Dez 2025'!BG54+'Jan-Abr 2026'!BG54+'Mai-Ago 2026'!BG54","v":0},{"$nulls":3},0,0,0,null,0,0,0,0,0,{"$f":"'Jan-Abr 2025'!BV54","v":0},{"$f":"'Jan-Abr 2025'!BU54+'Mai-Ago 2025'!BU54+'Set-Dez 2025'!BU54+'Jan-Abr 2026'!BU54+'Mai-Ago 2026'!BU54","v":0}]
[{"$nulls":32},"Fim",null,null,"PCT",0,0,0,560,0,0,0,0,0,{"$f":"'Jan-Abr 2025'!AT55","v":0},{"$f":"'Jan-Abr 2025'!AS55+'Mai-Ago 2025'!AS55+'Set-Dez 2025'!AS55+'Jan-Abr 2026'!AS55+'Mai-Ago 2026'!AS55","v":0},{"$nulls":3},0,0,0,null,0,0,0,0,0,{"$f":"'Jan-Abr 2025'!BH55","v":0},{"$f":"'Jan-Abr 2025'!BG55+'Mai-Ago 2025'!BG55+'Set-Dez 2025'!BG55+'Jan-Abr 2026'!BG55+'Mai-Ago 2026'!BG55","v":0},{"$nulls":3},0,0,0,null,0,0,0,0,0,{"$f":"'Jan-Abr 2025'!BV55","v":0},{"$f":"'Jan-Abr 2025'!BU55+'Mai-Ago 2025'!BU55+'Set-Dez 2025'!BU55+'Jan-Abr 2026'!BU55+'Mai-Ago 2026'!BU55","v":0}]
["Sociocultural",5146,"IGO","Introdução à Gestão das Organizações",{"$nulls":5},"B153",25,{"$nulls":7},6418,"OEM","Órgãos e Elementos de Máquinas",{"$nulls":5},"C591",50,{"$nulls":8},0,0,0,null,0,0,0,0,0,{"$f":"'Jan-Abr 2025'!AT56","v":0},{"$f":"'Jan-Abr 2025'!AS56+'Mai-Ago 2025'!AS56+'Set-Dez 2025'!AS56+'Jan-Abr 2026'!AS56+'Mai-Ago 2026'!AS56","v":0},{"$nulls":3},0,0,0,null,0,0,0,0,0,{"$f":"'Jan-Abr 2025'!BH56","v":0},{"$f":"'Jan-Abr 2025'!BG56+'Mai-Ago 2025'!BG56+'Set-Dez 2025'!BG56+'Jan-Abr 2026'!BG56+'Mai-Ago 2026'!BG56","v":0},{"$nulls":3},0,0,0,null,0,0,0,0,0,{"$f":"'Jan-Abr 2025'!BV56","v":0},{"$f":"'Jan-Abr 2025'!BU56+'Mai-Ago 2025'!BU56+'Set-Dez 2025'!BU56+'Jan-Abr 2026'!BU56+'Mai-Ago 2026'!BU56","v":0}]
[null,5152,"GMQ","Gestão e Motivação para a Qualidade",{"$nulls":5},"B155",25,{"$nulls":7},"6442","GP","Gestão de Projetos",{"$nulls":6},50,{"$nulls":8},0,0,0,null,0,0,0,0,0,{"$f":"'Jan-Abr 2025'!AT57","v":0},{"$f":"'Jan-Abr 2025'!AS57+'Mai-Ago 2025'!AS57+'Set-Dez 2025'!AS57+'Jan-Abr 2026'!AS57+'Mai-Ago 2026'!AS57","v":0},{"$nulls":3},0,0,0,null,0,0,0,0,0,{"$f":"'Jan-Abr 2025'!BH57","v":0},{"$f":"'Jan-Abr 2025'!BG57+'Mai-Ago 2025'!BG57+'Set-Dez 2025'!BG57+'Jan-Abr 2026'!BG57+'Mai-Ago 2026'!BG57","v":0},{"$nulls":3},0,0,0,null,0,0,0,0,0,{"$f":"'Jan-Abr 2025'!BV57","v":0},{"$f":"'Jan-Abr 2025'!BU57+'Mai-Ago 2025'!BU57+'Set-Dez 2025'!BU57+'Jan-Abr 2026'!BU57+'Mai-Ago 2026'!BU57","v":0}]
[null,5149,"SGQ","Sistama de Gestão da Qualidade ISO 9001",{"$nulls":5},"F369",25,{"$nulls":7},"6443","PP","Planeamento da Produção",{"$nulls":6},50,{"$nulls":8},0,0,0,null,0,0,0,0,0,{"$f":"'Jan-Abr 2025'!AT58","v":0},{"$f":"'Jan-Abr 2025'!AS58+'Mai-Ago 2025'!AS58+'Set-Dez 2025'!AS58+'Jan-Abr 2026'!AS58+'Mai-Ago 2026'!AS58","v":0},{"$nulls":3},0,0,0,null,0,0,0,0,0,{"$f":"'Jan-Abr 2025'!BH58","v":0},{"$f":"'Jan-Abr 2025'!BG58+'Mai-Ago 2025'!BG58+'Set-Dez 2025'!BG58+'Jan-Abr 2026'!BG58+'Mai-Ago 2026'!BG58","v":0},{"$nulls":3},0,0,0,null,0,0,0,0,0,{"$f":"'Jan-Abr 2025'!BV58","v":0},{"$f":"'Jan-Abr 2025'!BU58+'Mai-Ago 2025'!BU58+'Set-Dez 2025'!BU58+'Jan-Abr 2026'!BU58+'Mai-Ago 2026'!BU58","v":0}]
[null,349,"ASHST","Ambiente, Segurança, Higiene e Saúde no Trabalho",{"$nulls":5},"F423",25,{"$nulls":7},"6444","GS","Gestão de Stocks - Metodologias",{"$nulls":6},50,{"$nulls":8},0,0,0,null,0,0,0,0,0,{"$f":"'Jan-Abr 2025'!AT59","v":0},{"$f":"'Jan-Abr 2025'!AS59+'Mai-Ago 2025'!AS59+'Set-Dez 2025'!AS59+'Jan-Abr 2026'!AS59+'Mai-Ago 2026'!AS59","v":0},{"$nulls":3},0,0,0,null,0,0,0,0,0,{"$f":"'Jan-Abr 2025'!BH59","v":0},{"$f":"'Jan-Abr 2025'!BG59+'Mai-Ago 2025'!BG59+'Set-Dez 2025'!BG59+'Jan-Abr 2026'!BG59+'Mai-Ago 2026'!BG59","v":0},{"$nulls":3},0,0,0,null,0,0,0,0,0,{"$f":"'Jan-Abr 2025'!BV59","v":0},{"$f":"'Jan-Abr 2025'!BU59+'Mai-Ago 2025'!BU59+'Set-Dez 2025'!BU59+'Jan-Abr 2026'!BU59+'Mai-Ago 2026'!BU59","v":0}]
[null,5653,"DT","Direito do Trabalho",{"$nulls":5},"B154",25,{"$nulls":7},"1054","CGO","Custeio e Gestão Orçamental",{"$nulls":6},50,{"$nulls":8},0,0,0,null,0,0,0,0,0,{"$f":"'Jan-Abr 2025'!AT60","v":0},{"$f":"'Jan-Abr 2025'!AS60+'Mai-Ago 2025'!AS60+'Set-Dez 2025'!AS60+'Jan-Abr 2026'!AS60+'Mai-Ago 2026'!AS60","v":0},{"$nulls":3},0,0,0,null,0,0,0,0,0,{"$f":"'Jan-Abr 2025'!BH60","v":0},{"$f":"'Jan-Abr 2025'!BG60+'Mai-Ago 2025'!BG60+'Set-Dez 2025'!BG60+'Jan-Abr 2026'!BG60+'Mai-Ago 2026'!BG60","v":0},{"$nulls":3},0,0,0,null,0,0,0,0,0,{"$f":"'Jan-Abr 2025'!BV60","v":0},{"$f":"'Jan-Abr 2025'!BU60+'Mai-Ago 2025'!BU60+'Set-Dez 2025'!BU60+'Jan-Abr 2026'!BU60+'Mai-Ago 2026'!BU60","v":0}]
[null,5768,"ICS","Inglês em Contexto Socioprofissional",{"$nulls":5},"L046",25,{"$nulls":7},"6445","LOG","Logistica ",{"$nulls":6},50,{"$nulls":8},0,0,0,null,0,0,0,0,0,{"$f":"'Jan-Abr 2025'!AT61","v":0},{"$f":"'Jan-Abr 2025'!AS61+'Mai-Ago 2025'!AS61+'Set-Dez 2025'!AS61+'Jan-Abr 2026'!AS61+'Mai-Ago 2026'!AS61","v":0},{"$nulls":3},0,0,0,null,0,0,0,0,0,{"$f":"'Jan-Abr 2025'!BH61","v":0},{"$f":"'Jan-Abr 2025'!BG61+'Mai-Ago 2025'!BG61+'Set-Dez 2025'!BG61+'Jan-Abr 2026'!BG61+'Mai-Ago 2026'!BG61","v":0},{"$nulls":3},0,0,0,null,0,0,0,0,0,{"$f":"'Jan-Abr 2025'!BV61","v":0},{"$f":"'Jan-Abr 2025'!BU61+'Mai-Ago 2025'!BU61+'Set-Dez 2025'!BU61+'Jan-Abr 2026'!BU61+'Mai-Ago 2026'!BU61","v":0}]
[{"$nulls":18},"6446","MOT","Métodos e Organização do Trabalho",{"$nulls":6},50,{"$nulls":8},0,0,0,null,0,0,0,0,0,{"$f":"'Jan-Abr 2025'!AT62","v":0},{"$f":"'Jan-Abr 2025'!AS62+'Mai-Ago 2025'!AS62+'Set-Dez 2025'!AS62+'Jan-Abr 2026'!AS62+'Mai-Ago 2026'!AS62","v":0},{"$nulls":3},0,0,0,null,0,0,0,0,0,{"$f":"'Jan-Abr 2025'!BH62","v":0},{"$f":"'Jan-Abr 2025'!BG62+'Mai-Ago 2025'!BG62+'Set-Dez 2025'!BG62+'Jan-Abr 2026'!BG62+'Mai-Ago 2026'!BG62","v":0},{"$nulls":3},0,0,0,null,0,0,0,0,0,{"$f":"'Jan-Abr 2025'!BV62","v":0},{"$f":"'Jan-Abr 2025'!BU62+'Mai-Ago 2025'!BU62+'Set-Dez 2025'!BU62+'Jan-Abr 2026'!BU62+'Mai-Ago 2026'!BU62","v":0}]
[{"$nulls":18},"6447","SGI","Sistema de Gestão Integrada",{"$nulls":6},25,{"$nulls":8},0,0,0,null,0,0,0,0,0,{"$f":"'Jan-Abr 2025'!AT63","v":0},{"$f":"'Jan-Abr 2025'!AS63+'Mai-Ago 2025'!AS63+'Set-Dez 2025'!AS63+'Jan-Abr 2026'!AS63+'Mai-Ago 2026'!AS63","v":0},{"$nulls":3},0,0,0,null,{"$f":"COUNTIF($C$10:$AG$18,$AX63)","v":0},{"$f":"COUNTIF($C$22:$AG$30,$AX63)","v":0},{"$f":"COUNTIF($C$34:$AG$42,$AX63)","v":0},{"$f":"COUNTIF($C$46:$AG$54,$AX63)","v":0},0,{"$f":"'Jan-Abr 2025'!BH63","v":0},{"$f":"'Jan-Abr 2025'!BG63+'Mai-Ago 2025'!BG63+'Set-Dez 2025'!BG63+'Jan-Abr 2026'!BG63+'Mai-Ago 2026'!BG63","v":0},{"$nulls":3},0,0,0,null,0,0,0,0,0,{"$f":"'Jan-Abr 2025'!BV63","v":0},{"$f":"'Jan-Abr 2025'!BU63+'Mai-Ago 2025'!BU63+'Set-Dez 2025'!BU63+'Jan-Abr 2026'!BU63+'Mai-Ago 2026'!BU63","v":0}]
["Tecnológica",6407,"PFL","Processos de Fundição / Ligação",{"$nulls":5},"D333",25,{"$nulls":7},"6448","QCEP","Qualidade - controlo estatístico de processo",{"$nulls":6},50,{"$nulls":8},0,0,0,null,0,0,0,0,0,{"$f":"'Jan-Abr 2025'!AT64","v":0},{"$f":"'Jan-Abr 2025'!AS64+'Mai-Ago 2025'!AS64+'Set-Dez 2025'!AS64+'Jan-Abr 2026'!AS64+'Mai-Ago 2026'!AS64","v":0},{"$nulls":3},0,0,0,null,0,0,0,0,0,{"$f":"'Jan-Abr 2025'!BH64","v":0},{"$f":"'Jan-Abr 2025'!BG64+'Mai-Ago 2025'!BG64+'Set-Dez 2025'!BG64+'Jan-Abr 2026'!BG64+'Mai-Ago 2026'!BG64","v":0},{"$nulls":3},0,0,0,null,0,0,0,0,0,{"$f":"'Jan-Abr 2025'!BV64","v":0},{"$f":"'Jan-Abr 2025'!BU64+'Mai-Ago 2025'!BU64+'Set-Dez 2025'!BU64+'Jan-Abr 2026'!BU64+'Mai-Ago 2026'!BU64","v":0}]
[null,6408,"PCC","Processos de Conformação / Corte",{"$nulls":5},"D334",25,{"$nulls":25},0,0,0,null,0,0,0,0,0,{"$f":"'Jan-Abr 2025'!AT65","v":0},{"$f":"'Jan-Abr 2025'!AS65+'Mai-Ago 2025'!AS65+'Set-Dez 2025'!AS65+'Jan-Abr 2026'!AS65+'Mai-Ago 2026'!AS65","v":0},{"$nulls":3},0,0,0,null,0,0,0,0,0,{"$f":"'Jan-Abr 2025'!BH65","v":0},{"$f":"'Jan-Abr 2025'!BG65+'Mai-Ago 2025'!BG65+'Set-Dez 2025'!BG65+'Jan-Abr 2026'!BG65+'Mai-Ago 2026'!BG65","v":0},{"$nulls":3},0,0,0,null,0,0,0,{"$f":"COUNTIF($C$46:$AG$54,$BL65)","v":0},0,{"$f":"'Jan-Abr 2025'!BV65","v":0},{"$f":"'Jan-Abr 2025'!BU65+'Mai-Ago 2025'!BU65+'Set-Dez 2025'!BU65+'Jan-Abr 2026'!BU65+'Mai-Ago 2026'!BU65","v":0}]
[null,6409,"PAA","Processos por Arranque de Apara",{"$nulls":5},"C588",25,{"$nulls":25},0,0,0,null,0,0,0,0,0,{"$f":"'Jan-Abr 2025'!AT66","v":0},{"$f":"'Jan-Abr 2025'!AS66+'Mai-Ago 2025'!AS66+'Set-Dez 2025'!AS66+'Jan-Abr 2026'!AS66+'Mai-Ago 2026'!AS66","v":0},{"$nulls":3},0,0,0,null,0,0,0,0,0,{"$f":"'Jan-Abr 2025'!BH66","v":0},{"$f":"'Jan-Abr 2025'!BG66+'Mai-Ago 2025'!BG66+'Set-Dez 2025'!BG66+'Jan-Abr 2026'!BG66+'Mai-Ago 2026'!BG66","v":0},{"$nulls":3},0,0,0,null,0,0,0,0,0,{"$f":"'Jan-Abr 2025'!BV66","v":0},{"$f":"'Jan-Abr 2025'!BU66+'Mai-Ago 2025'!BU66+'Set-Dez 2025'!BU66+'Jan-Abr 2026'!BU66+'Mai-Ago 2026'!BU66","v":0}]
[null,6410,"IME","Instalação de Máquinas Elétricas",{"$nulls":5},"K252",50,{"$nulls":25},0,0,0,null,0,0,0,0,0,{"$f":"'Jan-Abr 2025'!AT67","v":0},{"$f":"'Jan-Abr 2025'!AS67+'Mai-Ago 2025'!AS67+'Set-Dez 2025'!AS67+'Jan-Abr 2026'!AS67+'Mai-Ago 2026'!AS67","v":0},{"$nulls":3},0,0,0,null,0,0,0,0,0,{"$f":"'Jan-Abr 2025'!BH67","v":0},{"$f":"'Jan-Abr 2025'!BG67+'Mai-Ago 2025'!BG67+'Set-Dez 2025'!BG67+'Jan-Abr 2026'!BG67+'Mai-Ago 2026'!BG67","v":0},{"$nulls":3},0,0,0,null,0,0,0,0,0,{"$f":"'Jan-Abr 2025'!BV67","v":0},{"$f":"'Jan-Abr 2025'!BU67+'Mai-Ago 2025'!BU67+'Set-Dez 2025'!BU67+'Jan-Abr 2026'!BU67+'Mai-Ago 2026'!BU67","v":0}]
[null,6411,"ELE","Eletrónica",{"$nulls":5},"K253",50,{"$nulls":25},0,0,0,null,0,0,0,0,0,{"$f":"'Jan-Abr 2025'!AT68","v":0},{"$f":"'Jan-Abr 2025'!AS68+'Mai-Ago 2025'!AS68+'Set-Dez 2025'!AS68+'Jan-Abr 2026'!AS68+'Mai-Ago 2026'!AS68","v":0},{"$nulls":3},0,0,0,null,0,0,0,0,0,{"$f":"'Jan-Abr 2025'!BH68","v":0},{"$f":"'Jan-Abr 2025'!BG68+'Mai-Ago 2025'!BG68+'Set-Dez 2025'!BG68+'Jan-Abr 2026'!BG68+'Mai-Ago 2026'!BG68","v":0},{"$nulls":3},0,0,0,null,0,0,0,0,0,{"$f":"'Jan-Abr 2025'!BV68","v":0},{"$f":"'Jan-Abr 2025'!BU68+'Mai-Ago 2025'!BU68+'Set-Dez 2025'!BU68+'Jan-Abr 2026'!BU68+'Mai-Ago 2026'!BU68","v":0}]
[null,6412,"CP","Circuitos Pneumáticos",{"$nulls":5},"E329",25,{"$nulls":25},0,0,0,null,0,0,0,0,0,{"$f":"'Jan-Abr 2025'!AT69","v":0},{"$f":"'Jan-Abr 2025'!AS69+'Mai-Ago 2025'!AS69+'Set-Dez 2025'!AS69+'Jan-Abr 2026'!AS69+'Mai-Ago 2026'!AS69","v":0},{"$nulls":3},0,0,0,null,0,0,0,0,0,{"$f":"'Jan-Abr 2025'!BH69","v":0},{"$f":"'Jan-Abr 2025'!BG69+'Mai-Ago 2025'!BG69+'Set-Dez 2025'!BG69+'Jan-Abr 2026'!BG69+'Mai-Ago 2026'!BG69","v":0},{"$nulls":3},0,0,0,null,0,0,0,0,0,{"$f":"'Jan-Abr 2025'!BV69","v":0},{"$f":"'Jan-Abr 2025'!BU69+'Mai-Ago 2025'!BU69+'Set-Dez 2025'!BU69+'Jan-Abr 2026'!BU69+'Mai-Ago 2026'!BU69","v":0}]
[null,6413,"CH","Circuitos Óleo-Hidráulicos",{"$nulls":5},"E330",25,{"$nulls":6},"Estágio",null,"PCT","Prática em Contexto Trabalho",{"$nulls":5},"E368",560,{"$nulls":8},0,0,0,null,0,0,0,0,0,{"$f":"'Jan-Abr 2025'!AT70","v":0},{"$f":"'Jan-Abr 2025'!AS70+'Mai-Ago 2025'!AS70+'Set-Dez 2025'!AS70+'Jan-Abr 2026'!AS70+'Mai-Ago 2026'!AS70","v":0},{"$nulls":3},0,0,0,null,0,0,0,0,0,{"$f":"'Jan-Abr 2025'!BH70","v":0},{"$f":"'Jan-Abr 2025'!BG70+'Mai-Ago 2025'!BG70+'Set-Dez 2025'!BG70+'Jan-Abr 2026'!BG70+'Mai-Ago 2026'!BG70","v":0},{"$nulls":3},0,0,0,null,0,0,0,0,0,{"$f":"'Jan-Abr 2025'!BV70","v":0},{"$f":"'Jan-Abr 2025'!BU70+'Mai-Ago 2025'!BU70+'Set-Dez 2025'!BU70+'Jan-Abr 2026'!BU70+'Mai-Ago 2026'!BU70","v":0}]
[null,6414,"CLP","Controladores Lógicos Programáveis",{"$nulls":5},"C589",50,{"$nulls":25},0,0,0,null,0,0,0,0,0,{"$f":"'Jan-Abr 2025'!AT71","v":0},{"$f":"'Jan-Abr 2025'!AS71+'Mai-Ago 2025'!AS71+'Set-Dez 2025'!AS71+'Jan-Abr 2026'!AS71+'Mai-Ago 2026'!AS71","v":0},{"$nulls":3},0,0,0,null,0,0,0,0,0,{"$f":"'Jan-Abr 2025'!BH71","v":0},{"$f":"'Jan-Abr 2025'!BG71+'Mai-Ago 2025'!BG71+'Set-Dez 2025'!BG71+'Jan-Abr 2026'!BG71+'Mai-Ago 2026'!BG71","v":0},{"$nulls":3},0,0,0,null,0,0,0,0,0,{"$f":"'Jan-Abr 2025'!BV71","v":0},{"$f":"'Jan-Abr 2025'!BU71+'Mai-Ago 2025'!BU71+'Set-Dez 2025'!BU71+'Jan-Abr 2026'!BU71+'Mai-Ago 2026'!BU71","v":0}]
[null,6415,"DCM","Desenho de Construções Mecânicas",{"$nulls":5},"A438",50,{"$nulls":25},{"$f":"IF(AI72=$DC$8,AM72,IF(AI72=$DC$9,AM72,IF(AI72=$DC$10,AL72,)))","v":0},0,{"$f":"IF(AI72=$DC$8,AL72,IF(AI72=$DC$9,AM73+AL72,IF(AI72=$DC$10,IF(AI73=$DC$10,AM73+AL72,AL72),)))","v":0},null,0,0,0,0,{"$f":"SUM(AO72:AR72)","v":0},{"$f":"'Jan-Abr 2025'!AT72","v":0},{"$f":"'Jan-Abr 2025'!AS72+'Mai-Ago 2025'!AS72+'Set-Dez 2025'!AS72+'Jan-Abr 2026'!AS72+'Mai-Ago 2026'!AS72","v":0},{"$nulls":3},{"$f":"IF(AW72=$DC$8,BA72,IF(AW72=$DC$9,BA72,IF(AW72=$DC$10,AZ72,)))","v":0},0,{"$f":"IF(AW72=$DC$8,AZ72,IF(AW72=$DC$9,BA73+AZ72,IF(AW72=$DC$10,IF(AW73=$DC$10,BA73+AZ72,AZ72),)))","v":0},null,0,0,0,0,0,{"$f":"'Jan-Abr 2025'!BH72","v":0},{"$f":"'Jan-Abr 2025'!BG72+'Mai-Ago 2025'!BG72+'Set-Dez 2025'!BG72+'Jan-Abr 2026'!BG72+'Mai-Ago 2026'!BG72","v":0},{"$nulls":3},{"$f":"IF(BK72=$DC$8,BO72,IF(BK72=$DC$9,BO72,IF(BK72=$DC$10,BN72,)))","v":0},0,{"$f":"IF(BK72=$DC$8,BN72,IF(BK72=$DC$9,BO73+BN72,IF(BK72=$DC$10,IF(BK73=$DC$10,BO73+BN72,BN72),)))","v":0},null,0,0,0,0,{"$f":"SUM(BQ72:BT72)","v":0},{"$f":"'Jan-Abr 2025'!BV72","v":0},{"$f":"'Jan-Abr 2025'!BU72+'Mai-Ago 2025'!BU72+'Set-Dez 2025'!BU72+'Jan-Abr 2026'!BU72+'Mai-Ago 2026'!BU72","v":0}]
[null,6416,"CM","Ciência dos Materiais",{"$nulls":5},"C590",50,{"$nulls":25},0,{"$f":"IF($AK$4=$DB$8,AS73,IF($AK$4=$DB$9,AT73,IF($AK$4=$DB$10,AU73,IF($AK$4=$DB$11,AO73,IF($AK$4=$DB$12,AP73,IF($AK$4=$DB$13,AQ73,IF($AK$4=$DB$14,AR73,\"\")))))))","v":0},0,null,{"$f":"COUNTIF($C$10:$AG$18,$AJ73)","v":0},{"$f":"COUNTIF($C$22:$AG$30,$AJ73)","v":0},{"$f":"COUNTIF($C$34:$AG$42,$AJ73)","v":0},{"$f":"COUNTIF($C$46:$AG$54,$AJ73)","v":0},0,{"$f":"'Jan-Abr 2025'!AT73","v":0},{"$f":"'Jan-Abr 2025'!AS73+'Mai-Ago 2025'!AS73+'Set-Dez 2025'!AS73+'Jan-Abr 2026'!AS73+'Mai-Ago 2026'!AS73","v":0},{"$nulls":3},0,{"$f":"IF($AK$4=$DB$8,BG73,IF($AK$4=$DB$9,BH73,IF($AK$4=$DB$10,BI73,IF($AK$4=$DB$11,BC73,IF($AK$4=$DB$12,BD73,IF($AK$4=$DB$13,BE73,IF($AK$4=$DB$14,BF73,\"\")))))))","v":0},0,null,{"$f":"COUNTIF($C$10:$AG$18,$AX73)","v":0},{"$f":"COUNTIF($C$22:$AG$30,$AX73)","v":0},{"$f":"COUNTIF($C$34:$AG$42,$AX73)","v":0},{"$f":"COUNTIF($C$46:$AG$54,$AX73)","v":0},{"$f":"SUM(BC73:BF73)","v":0},{"$f":"'Jan-Abr 2025'!BH73","v":0},{"$f":"'Jan-Abr 2025'!BG73+'Mai-Ago 2025'!BG73+'Set-Dez 2025'!BG73+'Jan-Abr 2026'!BG73+'Mai-Ago 2026'!BG73","v":0},{"$nulls":3},0,{"$f":"IF($AK$4=$DB$8,BU73,IF($AK$4=$DB$9,BV73,IF($AK$4=$DB$10,BW73,IF($AK$4=$DB$11,BQ73,IF($AK$4=$DB$12,BR73,IF($AK$4=$DB$13,BS73,IF($AK$4=$DB$14,BT73,\"\")))))))","v":0},0,null,{"$f":"COUNTIF($C$10:$AG$18,$BL73)","v":0},{"$f":"COUNTIF($C$22:$AG$30,$BL73)","v":0},{"$f":"COUNTIF($C$34:$AG$42,$BL73)","v":0},{"$f":"COUNTIF($C$46:$AG$54,$BL73)","v":0},0,{"$f":"'Jan-Abr 2025'!BV73","v":0},{"$f":"'Jan-Abr 2025'!BU73+'Mai-Ago 2025'!BU73+'Set-Dez 2025'!BU73+'Jan-Abr 2026'!BU73+'Mai-Ago 2026'!BU73","v":0}]
[null,6417,"SD","Sistemas Digitais",{"$nulls":5},"I159",50,{"$nulls":9},"Seg.","Ter.","Qua.","Qui.","Sex."]
[{"$nulls":19},"Salas:",{"$nulls":16},{"$f":"SUMIF(AI8:AI73,\"=M\",AK8:AK73)+SUMIF(AI8:AI73,\"=T\",AK8:AK73)","v":0},null,null,{"$f":"SUMIF(AI8:AI73,\"=M\",AN8:AN73)+SUMIF(AI8:AI73,\"=T\",AN8:AN73)","v":0},{"$nulls":10},{"$f":"SUMIF(AW8:AW73,\"=M\",AY8:AY73)+SUMIF(AW8:AW73,\"=T\",AY8:AY73)","v":0},null,null,{"$f":"SUMIF(AW8:AW73,\"=M\",BB8:BB73)+SUMIF(AW8:AW73,\"=T\",BB8:BB73)","v":0},{"$nulls":10},{"$f":"SUMIF(BK8:BK73,\"=M\",BM8:BM73)+SUMIF(BK8:BK73,\"=T\",BM8:BM73)","v":0},null,null,{"$f":"SUMIF(BK8:BK73,\"=M\",BP8:BP73)+SUMIF(BK8:BK73,\"=T\",BP8:BP73)","v":0}]
[{"$nulls":34},"Totais",null,{"$f":"AK75+AY75+BM75","v":0},null,null,{"$f":"AN75+BB75+BP75","v":0}]
["R. Quantitativas:"]

{"sheet":"Set-Dez 2026","index":6,"n_rows":77,"n_cols":107,"rows_kept":77,"merged":[[0,25,0,32],[0,34,2,39],[0,40,6,40],[0,41,6,41],[0,42,6,42],[0,43,6,43],[0,44,6,44],[0,45,6,45],[0,46,6,46],[0,48,2,53],[0,54,6,54],[0,55,6,55],[0,56,6,56],[0,57,6,57],[0,58,6,58],[0,59,6,59],[0,60,6,60],[0,62,2,67],[0,68,6,68],[0,69,6,69],[0,70,6,70],[0,71,6,71],[0,72,6,72],[0,73,6,73],[0,74,6,74],[0,105,6,105],[0,106,6,106],[1,25,1,32],[2,25,2,32],[3,25,3,32],[3,34,6,34],[3,35,6,35],[3,36,6,36],[3,37,6,37],[3,38,6,38],[3,39,6,39],[3,48,6,48],[3,49,6,49],[3,50,6,50],[3,51,6,51],[3,52,6,52],[3,53,6,53],[3,62,6,62],[3,63,6,63],[3,64,6,64],[3,65,6,65],[3,66,6,66],[3,67,6,67],[4,0,4,2],[4,3,4,9],[4,10,4,13],[4,14,4,21],[4,22,4,26],[4,27,4,29],[4,30,4,32],[5,0,5,2],[5,3,5,9],[5,10,5,13],[5,14,5,21],[5,22,5,26],[5,27,5,29],[5,30,5,32],[6,0,6,2],[6,3,6,9],[6,10,6,13],[6,14,6,21],[6,22,6,26],[6,27,6,29],[6,30,6,32],[7,0,8,1],[9,0,9,1],[10,0,10,1],[11,0,11,1],[12,0,12,1],[14,0,14,1],[15,0,15,1],[16,0,16,1],[17,0,17,1],[19,0,20,1],[21,0,21,1],[22,0,22,1],[23,0,23,1],[24,0,24,1],[25,0,25,1],[26,0,26,1],[27,0,27,1],[28,0,28,1],[29,0,29,1],[31,0,32,1],[33,0,33,1],[34,0,34,1],[35,0,35,1],[36,0,36,1],[37,0,37,1],[38,0,38,1],[39,0,39,1],[40,0,40,1],[41,0,41,1],[43,0,44,1],[45,0,45,1],[46,0,46,1],[47,0,47,1],[48,0,48,1],[49,0,49,1],[50,0,50,1],[51,0,51,1],[52,0,52,1],[53,0,53,1],[54,2,54,8],[54,11,54,13],[54,17,54,19],[54,20,54,25],[54,28,54,30],[55,0,60,0],[55,3,55,8],[55,11,55,13],[55,17,63,17],[55,20,55,25],[55,28,55,30],[56,3,56,8],[56,11,56,13],[56,20,56,25],[56,28,56,30],[57,3,57,8],[57,11,57,13],[57,20,57,25],[57,28,57,30],[58,3,58,8],[58,11,58,13],[58,20,58,25],[58,28,58,30],[59,3,59,8],[59,11,59,13],[59,20,59,25],[59,28,59,30],[60,3,60,8],[60,11,60,13],[60,20,60,25],[60,28,60,30],[61,20,61,25],[61,28,61,30],[62,20,62,25],[63,0,73,0],[63,3,63,8],[63,11,63,13],[63,20,63,25],[64,3,64,8],[64,11,64,13],[65,3,65,8],[65,11,65,13],[66,3,66,8],[66,11,66,13],[67,3,67,8],[67,11,67,13],[68,3,68,8],[68,11,68,13],[69,3,69,8],[69,11,69,13],[70,3,70,8],[70,11,70,13],[71,3,71,8],[71,11,71,13],[72,3,72,8],[72,11,72,13],[73,3,73,8],[73,11,73,13],[75,34,75,35],[76,2,76,3],[76,4,76,5],[76,6,76,7],[76,8,76,9],[76,10,76,11],[76,12,76,13]]}
[{"$nulls":40},{"$f":"TEXT($A$8,\"mmm\")","v":"set"},{"$f":"TEXT($A$20,\"mmm\")","v":"out"},{"$f":"TEXT($A$32,\"mmm\")","v":"nov"},{"$f":"TEXT($A$44,\"mmm\")","v":"dez"},"Total  Folha","Total Global","Total  Acum.",{"$nulls":7},{"$f":"TEXT($A$8,\"mmm\")","v":"set"},{"$f":"TEXT($A$20,\"mmm\")","v":"out"},{"$f":"TEXT($A$32,\"mmm\")","v":"nov"},{"$f":"TEXT($A$44,\"mmm\")","v":"dez"},"Total  Folha","Total Global","Total  Acum.",{"$nulls":7},{"$f":"TEXT($A$8,\"mmm\")","v":"set"},{"$f":"TEXT($A$20,\"mmm\")","v":"out"},{"$f":"TEXT($A$32,\"mmm\")","v":"nov"},{"$f":"TEXT($A$44,\"mmm\")","v":"dez"},"Total  Folha","Total Global","Total  Acum.",{"$nulls":30},"tipo_soma","tipo_contador"]
[{"$nulls":25},"Director(a):"]
[{"$nulls":25},"(Cristina Botas)"]
[{"$nulls":34},"Tipo","Módulo","ST","Origem","Cálculo","Objetivo",{"$nulls":8},"Tipo","Módulo",{"$f":"AK4","v":"ST"},"Origem","Cálculo","Objetivo",{"$nulls":8},"Tipo","Módulo",{"$f":"AK4","v":"ST"},"Origem","Cálculo","Objetivo"]
["MODALIDADE:",{"$nulls":9},"CODÍGO DA AÇÃO:",{"$nulls":16},"       U.O.:",null,null,"Torres Vedras"]
["PLANEAMENTO:",{"$nulls":9},"SAÍDA PROFISSIONAL: Técnico/a Especialista em Mecatrónica",{"$nulls":16},"DATA INÍCIO:"]
["COORDENADOR:",{"$nulls":9},"DURAÇÃO:",{"$nulls":16},"DATA FIM  (previsto):"]
["2026-09-01",null,{"$f":"IF(C9<>\"\",CHOOSE(WEEKDAY(C9,1),\"Dom.\",\"Seg.\",\"Ter.\",\"Qua.\",\"Qui.\",\"Sex.\",\"Sáb.\"),\"\")","v":"Ter."},{"$f":"IF(D9<>\"\",CHOOSE(WEEKDAY(D9,1),\"Dom.\",\"Seg.\",\"Ter.\",\"Qua.\",\"Qui.\",\"Sex.\",\"Sáb.\"),\"\")","v":"Qua."},"Qui.","Sex.","Sáb.","Dom.","Seg.","Ter.","Qua.","Qui.","Sex.","Sáb.","Dom.","Seg.","Ter.","Qua.","Qui.","Sex.","Sáb.","Dom.","Seg.","Ter.","Qua.","Qui.","Sex.","Sáb.","Dom.","Seg.","Ter.","Qua.","",null,null,"IGO",{"$f":"IF(AI8=$DC$8,AM8,IF(AI8=$DC$9,AM8,IF(AI8=$DC$10,AL8,)))","v":0},{"$f":"IF($AK$4=$DB$8,AS8,IF($AK$4=$DB$9,AT8,IF($AK$4=$DB$10,AU8,IF($AK$4=$DB$11,AO8,IF($AK$4=$DB$12,AP8,IF($AK$4=$DB$13,AQ8,IF($AK$4=$DB$14,AR8,\"\")))))))","v":0},{"$f":"IF(AI8=$DC$8,AL8,IF(AI8=$DC$9,AM9+AL8,IF(AI8=$DC$10,IF(AI9=$DC$10,AM9+AL8,AL8),)))","v":0},25,{"$f":"COUNTIF($C$10:$AG$18,$AJ8)","v":0},{"$f":"COUNTIF($C$22:$AG$30,$AJ8)","v":0},{"$f":"COUNTIF($C$34:$AG$42,$AJ8)","v":0},{"$f":"COUNTIF($C$46:$AG$54,$AJ8)","v":0},{"$f":"SUM(AO8:AR8)","v":0},{"$f":"'Jan-Abr 2025'!AT8","v":0},{"$f":"'Jan-Abr 2025'!AS8+'Mai-Ago 2025'!AS8+'Set-Dez 2025'!AS8+'Jan-Abr 2026'!AS8+'Mai-Ago 2026'!AS8+'Set-Dez 2026'!AS8","v":0},{"$nulls":3},{"$f":"IF(AW8=$DC$8,BA8,IF(AW8=$DC$9,BA8,IF(AW8=$DC$10,AZ8,)))","v":0},{"$f":"IF($AK$4=$DB$8,BG8,IF($AK$4=$DB$9,BH8,IF($AK$4=$DB$10,BI8,IF($AK$4=$DB$11,BC8,IF($AK$4=$DB$12,BD8,IF($AK$4=$DB$13,BE8,IF($AK$4=$DB$14,BF8,\"\")))))))","v":0},{"$f":"IF(AW8=$DC$8,AZ8,IF(AW8=$DC$9,BA9+AZ8,IF(AW8=$DC$10,IF(AW9=$DC$10,BA9+AZ8,AZ8),)))","v":0},null,{"$f":"COUNTIF($C$10:$AG$18,$AX8)","v":0},{"$f":"COUNTIF($C$22:$AG$30,$AX8)","v":0},{"$f":"COUNTIF($C$34:$AG$42,$AX8)","v":0},{"$f":"COUNTIF($C$46:$AG$54,$AX8)","v":0},{"$f":"SUM(BC8:BF8)","v":0},{"$f":"'Jan-Abr 2025'!BH8","v":0},{"$f":"'Jan-Abr 2025'!BG8+'Mai-Ago 2025'!BG8+'Set-Dez 2025'!BG8+'Jan-Abr 2026'!BG8+'Mai-Ago 2026'!BG8+'Set-Dez 2026'!BG8","v":0},{"$nulls":3},{"$f":"IF(BK8=$DC$8,BO8,IF(BK8=$DC$9,BO8,IF(BK8=$DC$10,BN8,)))","v":0},{"$f":"IF($AK$4=$DB$8,BU8,IF($AK$4=$DB$9,BV8,IF($AK$4=$DB$10,BW8,IF($AK$4=$DB$11,BQ8,IF($AK$4=$DB$12,BR8,IF($AK$4=$DB$13,BS8,IF($AK$4=$DB$14,BT8,\"\")))))))","v":0},{"$f":"IF(BK8=$DC$8,BN8,IF(BK8=$DC$9,BO9+BN8,IF(BK8=$DC$10,IF(BK9=$DC$10,BO9+BN8,BN8),)))","v":0},null,{"$f":"COUNTIF($C$10:$AG$18,$BL8)","v":0},{"$f":"COUNTIF($C$22:$AG$30,$BL8)","v":0},{"$f":"COUNTIF($C$34:$AG$42,$BL8)","v":0},{"$f":"COUNTIF($C$46:$AG$54,$BL8)","v":0},{"$f":"SUM(BQ8:BT8)","v":0},{"$f":"'Jan-Abr 2025'!BV8","v":0},{"$f":"'Jan-Abr 2025'!BU8+'Mai-Ago 2025'!BU8+'Set-Dez 2025'!BU8+'Jan-Abr 2026'!BU8+'Mai-Ago 2026'!BU8+'Set-Dez 2026'!BU8","v":0},{"$nulls":30},"SF","M"]
[null,null,{"$f":"A8","v":"2026-09-01"},{"$f":"IF(C9=\"\",\"\",IF(DAY(C9)<DAY(EOMONTH(C9,0)),C9+1,\"\"))","v":"2026-09-02"},{"$f":"IF(D9=\"\",\"\",IF(DAY(D9)<DAY(EOMONTH(D9,0)),D9+1,\"\"))","v":"2026-09-03"},"2026-09-04","2026-09-05","2026-09-06","2026-09-07","2026-09-08",{"$f":"IF(J9=\"\",\"\",IF(DAY(J9)<DAY(EOMONTH(J9,0)),J9+1,\"\"))","v":"2026-09-09"},{"$f":"IF(K9=\"\",\"\",IF(DAY(K9)<DAY(EOMONTH(K9,0)),K9+1,\"\"))","v":"2026-09-10"},"2026-09-11","2026-09-12","2026-09-13","2026-09-14","2026-09-15",{"$f":"IF(Q9=\"\",\"\",IF(DAY(Q9)<DAY(EOMONTH(Q9,0)),Q9+1,\"\"))","v":"2026-09-16"},{"$f":"IF(R9=\"\",\"\",IF(DAY(R9)<DAY(EOMONTH(R9,0)),R9+1,\"\"))","v":"2026-09-17"},"2026-09-18","2026-09-19","2026-09-20","2026-09-21","2026-09-22",{"$f":"IF(X9=\"\",\"\",IF(DAY(X9)<DAY(EOMONTH(X9,0)),X9+1,\"\"))","v":"2026-09-23"},{"$f":"IF(Y9=\"\",\"\",IF(DAY(Y9)<DAY(EOMONTH(Y9,0)),Y9+1,\"\"))","v":"2026-09-24"},"2026-09-25","2026-09-26","2026-09-27","2026-09-28","2026-09-29",{"$f":"IF(AE9=\"\",\"\",IF(DAY(AE9)<DAY(EOMONTH(AE9,0)),AE9+1,\"\"))","v":"2026-09-30"},{"$f":"IF(AF9=\"\",\"\",IF(DAY(AF9)<DAY(EOMONTH(AF9,0)),AF9+1,\"\"))","v":""},null,null,"GMQ",0,{"$f":"IF($AK$4=$DB$8,AS9,IF($AK$4=$DB$9,AT9,IF($AK$4=$DB$10,AU9,IF($AK$4=$DB$11,AO9,IF($AK$4=$DB$12,AP9,IF($AK$4=$DB$13,AQ9,IF($AK$4=$DB$14,AR9,\"\")))))))","v":0},0,25,{"$f":"COUNTIF($C$10:$AG$18,$AJ9)","v":0},{"$f":"COUNTIF($C$22:$AG$30,$AJ9)","v":0},{"$f":"COUNTIF($C$34:$AG$42,$AJ9)","v":0},{"$f":"COUNTIF($C$46:$AG$54,$AJ9)","v":0},0,{"$f":"'Jan-Abr 2025'!AT9","v":0},{"$f":"'Jan-Abr 2025'!AS9+'Mai-Ago 2025'!AS9+'Set-Dez 2025'!AS9+'Jan-Abr 2026'!AS9+'Mai-Ago 2026'!AS9+'Set-Dez 2026'!AS9","v":0},{"$nulls":3},0,{"$f":"IF($AK$4=$DB$8,BG9,IF($AK$4=$DB$9,BH9,IF($AK$4=$DB$10,BI9,IF($AK$4=$DB$11,BC9,IF($AK$4=$DB$12,BD9,IF($AK$4=$DB$13,BE9,IF($AK$4=$DB$14,BF9,\"\")))))))","v":0},0,null,{"$f":"COUNTIF($C$10:$AG$18,$AX9)","v":0},{"$f":"COUNTIF($C$22:$AG$30,$AX9)","v":0},{"$f":"COUNTIF($C$34:$AG$42,$AX9)","v":0},{"$f":"COUNTIF($C$46:$AG$54,$AX9)","v":0},{"$f":"SUM(BC9:BF9)","v":0},{"$f":"'Jan-Abr 2025'!BH9","v":0},{"$f":"'Jan-Abr 2025'!BG9+'Mai-Ago 2025'!BG9+'Set-Dez 2025'!BG9+'Jan-Abr 2026'!BG9+'Mai-Ago 2026'!BG9+'Set-Dez 2026'!BG9","v":0},{"$nulls":3},0,{"$f":"IF($AK$4=$DB$8,BU9,IF($AK$4=$DB$9,BV9,IF($AK$4=$DB$10,BW9,IF($AK$4=$DB$11,BQ9,IF($AK$4=$DB$12,BR9,IF($AK$4=$DB$13,BS9,IF($AK$4=$DB$14,BT9,\"\")))))))","v":0},0,null,{"$f":"COUNTIF($C$10:$AG$18,$BL9)","v":0},{"$f":"COUNTIF($C$22:$AG$30,$BL9)","v":0},{"$f":"COUNTIF($C$34:$AG$42,$BL9)","v":0},{"$f":"COUNTIF($C$46:$AG$54,$BL9)","v":0},0,{"$f":"'Jan-Abr 2025'!BV9","v":0},{"$f":"'Jan-Abr 2025'!BU9+'Mai-Ago 2025'!BU9+'Set-Dez 2025'!BU9+'Jan-Abr 2026'!BU9+'Mai-Ago 2026'!BU9+'Set-Dez 2026'!BU9","v":0},{"$nulls":30},"ST","T"]
["09h00 - 09h50",{"$nulls":34},"SGQ",0,0,0,25,0,0,0,0,0,{"$f":"'Jan-Abr 2025'!AT10","v":0},{"$f":"'Jan-Abr 2025'!AS10+'Mai-Ago 2025'!AS10+'Set-Dez 2025'!AS10+'Jan-Abr 2026'!AS10+'Mai-Ago 2026'!AS10+'Set-Dez 2026'!AS10","v":0},{"$nulls":3},0,0,0,null,0,0,0,0,0,{"$f":"'Jan-Abr 2025'!BH10","v":0},{"$f":"'Jan-Abr 2025'!BG10+'Mai-Ago 2025'!BG10+'Set-Dez 2025'!BG10+'Jan-Abr 2026'!BG10+'Mai-Ago 2026'!BG10+'Set-Dez 2026'!BG10","v":0},{"$nulls":3},0,0,0,null,0,0,0,0,0,{"$f":"'Jan-Abr 2025'!BV10","v":0},{"$f":"'Jan-Abr 2025'!BU10+'Mai-Ago 2025'!BU10+'Set-Dez 2025'!BU10+'Jan-Abr 2026'!BU10+'Mai-Ago 2026'!BU10+'Set-Dez 2026'!BU10","v":0},{"$nulls":30},"SA","P"]
["09h50 - 10h40",{"$nulls":34},"ASHST",0,0,0,25,0,0,0,0,0,{"$f":"'Jan-Abr 2025'!AT11","v":0},{"$f":"'Jan-Abr 2025'!AS11+'Mai-Ago 2025'!AS11+'Set-Dez 2025'!AS11+'Jan-Abr 2026'!AS11+'Mai-Ago 2026'!AS11+'Set-Dez 2026'!AS11","v":0},{"$nulls":3},0,0,0,null,0,0,0,0,0,{"$f":"'Jan-Abr 2025'!BH11","v":0},{"$f":"'Jan-Abr 2025'!BG11+'Mai-Ago 2025'!BG11+'Set-Dez 2025'!BG11+'Jan-Abr 2026'!BG11+'Mai-Ago 2026'!BG11+'Set-Dez 2026'!BG11","v":0},{"$nulls":3},0,0,0,null,0,0,0,0,0,{"$f":"'Jan-Abr 2025'!BV11","v":0},{"$f":"'Jan-Abr 2025'!BU11+'Mai-Ago 2025'!BU11+'Set-Dez 2025'!BU11+'Jan-Abr 2026'!BU11+'Mai-Ago 2026'!BU11+'Set-Dez 2026'!BU11","v":0},{"$nulls":30},{"$f":"TEXT(A8,\"mmm\")","v":"set"}]
["11h00 - 11h50",{"$nulls":34},"DT",0,0,0,25,0,0,0,0,0,{"$f":"'Jan-Abr 2025'!AT12","v":0},{"$f":"'Jan-Abr 2025'!AS12+'Mai-Ago 2025'!AS12+'Set-Dez 2025'!AS12+'Jan-Abr 2026'!AS12+'Mai-Ago 2026'!AS12+'Set-Dez 2026'!AS12","v":0},{"$nulls":3},0,0,0,null,0,0,0,0,0,{"$f":"'Jan-Abr 2025'!BH12","v":0},{"$f":"'Jan-Abr 2025'!BG12+'Mai-Ago 2025'!BG12+'Set-Dez 2025'!BG12+'Jan-Abr 2026'!BG12+'Mai-Ago 2026'!BG12+'Set-Dez 2026'!BG12","v":0},{"$nulls":3},0,0,0,null,0,0,0,0,0,{"$f":"'Jan-Abr 2025'!BV12","v":0},{"$f":"'Jan-Abr 2025'!BU12+'Mai-Ago 2025'!BU12+'Set-Dez 2025'!BU12+'Jan-Abr 2026'!BU12+'Mai-Ago 2026'!BU12+'Set-Dez 2026'!BU12","v":0},{"$nulls":30},{"$f":"TEXT(A20,\"mmm\")","v":"out"}]
["11h50 - 12h40",{"$nulls":34},"ICS",0,0,0,25,0,0,0,0,0,{"$f":"'Jan-Abr 2025'!AT13","v":0},{"$f":"'Jan-Abr 2025'!AS13+'Mai-Ago 2025'!AS13+'Set-Dez 2025'!AS13+'Jan-Abr 2026'!AS13+'Mai-Ago 2026'!AS13+'Set-Dez 2026'!AS13","v":0},{"$nulls":3},0,0,0,null,0,0,0,0,0,{"$f":"'Jan-Abr 2025'!BH13","v":0},{"$f":"'Jan-Abr 2025'!BG13+'Mai-Ago 2025'!BG13+'Set-Dez 2025'!BG13+'Jan-Abr 2026'!BG13+'Mai-Ago 2026'!BG13+'Set-Dez 2026'!BG13","v":0},{"$nulls":3},0,0,0,null,0,0,0,0,0,{"$f":"'Jan-Abr 2025'!BV13","v":0},{"$f":"'Jan-Abr 2025'!BU13+'Mai-Ago 2025'!BU13+'Set-Dez 2025'!BU13+'Jan-Abr 2026'!BU13+'Mai-Ago 2026'!BU13+'Set-Dez 2026'!BU13","v":0},{"$nulls":30},{"$f":"TEXT(A32,\"mmm\")","v":"nov"}]
[{"$nulls":36},0,0,0,null,0,0,0,0,0,{"$f":"'Jan-Abr 2025'!AT14","v":0},{"$f":"'Jan-Abr 2025'!AS14+'Mai-Ago 2025'!AS14+'Set-Dez 2025'!AS14+'Jan-Abr 2026'!AS14+'Mai-Ago 2026'!AS14+'Set-Dez 2026'!AS14","v":0},{"$nulls":3},0,0,0,null,0,0,0,0,0,{"$f":"'Jan-Abr 2025'!BH14","v":0},{"$f":"'Jan-Abr 2025'!BG14+'Mai-Ago 2025'!BG14+'Set-Dez 2025'!BG14+'Jan-Abr 2026'!BG14+'Mai-Ago 2026'!BG14+'Set-Dez 2026'!BG14","v":0},{"$nulls":3},0,0,0,null,0,0,0,0,0,{"$f":"'Jan-Abr 2025'!BV14","v":0},{"$f":"'Jan-Abr 2025'!BU14+'Mai-Ago 2025'!BU14+'Set-Dez 2025'!BU14+'Jan-Abr 2026'!BU14+'Mai-Ago 2026'!BU14+'Set-Dez 2026'!BU14","v":0},{"$nulls":30},{"$f":"TEXT(A44,\"mmm\")","v":"dez"}]
["14h00 - 14h50",{"$nulls":34},"PFL",0,0,0,25,0,0,0,0,0,{"$f":"'Jan-Abr 2025'!AT15","v":0},{"$f":"'Jan-Abr 2025'!AS15+'Mai-Ago 2025'!AS15+'Set-Dez 2025'!AS15+'Jan-Abr 2026'!AS15+'Mai-Ago 2026'!AS15+'Set-Dez 2026'!AS15","v":0},{"$nulls":3},0,0,0,null,0,0,0,0,0,{"$f":"'Jan-Abr 2025'!BH15","v":0},{"$f":"'Jan-Abr 2025'!BG15+'Mai-Ago 2025'!BG15+'Set-Dez 2025'!BG15+'Jan-Abr 2026'!BG15+'Mai-Ago 2026'!BG15+'Set-Dez 2026'!BG15","v":0},{"$nulls":3},0,0,0,null,0,0,0,0,0,{"$f":"'Jan-Abr 2025'!BV15","v":0},{"$f":"'Jan-Abr 2025'!BU15+'Mai-Ago 2025'!BU15+'Set-Dez 2025'!BU15+'Jan-Abr 2026'!BU15+'Mai-Ago 2026'!BU15+'Set-Dez 2026'!BU15","v":0}]
["14h50 - 15h40",{"$nulls":34},"PCC",0,0,0,25,0,0,0,0,0,{"$f":"'Jan-Abr 2025'!AT16","v":0},{"$f":"'Jan-Abr 2025'!AS16+'Mai-Ago 2025'!AS16+'Set-Dez 2025'!AS16+'Jan-Abr 2026'!AS16+'Mai-Ago 2026'!AS16+'Set-Dez 2026'!AS16","v":0},{"$nulls":3},0,0,0,null,0,0,0,0,0,{"$f":"'Jan-Abr 2025'!BH16","v":0},{"$f":"'Jan-Abr 2025'!BG16+'Mai-Ago 2025'!BG16+'Set-Dez 2025'!BG16+'Jan-Abr 2026'!BG16+'Mai-Ago 2026'!BG16+'Set-Dez 2026'!BG16","v":0},{"$nulls":3},0,0,0,null,0,0,0,0,0,{"$f":"'Jan-Abr 2025'!BV16","v":0},{"$f":"'Jan-Abr 2025'!BU16+'Mai-Ago 2025'!BU16+'Set-Dez 2025'!BU16+'Jan-Abr 2026'!BU16+'Mai-Ago 2026'!BU16+'Set-Dez 2026'!BU16","v":0}]
["16h00 - 16h50",{"$nulls":34},"PAA",0,0,0,25,0,0,0,0,0,{"$f":"'Jan-Abr 2025'!AT17","v":0},{"$f":"'Jan-Abr 2025'!AS17+'Mai-Ago 2025'!AS17+'Set-Dez 2025'!AS17+'Jan-Abr 2026'!AS17+'Mai-Ago 2026'!AS17+'Set-Dez 2026'!AS17","v":0},{"$nulls":3},0,0,0,null,0,0,0,0,0,{"$f":"'Jan-Abr 2025'!BH17","v":0},{"$f":"'Jan-Abr 2025'!BG17+'Mai-Ago 2025'!BG17+'Set-Dez 2025'!BG17+'Jan-Abr 2026'!BG17+'Mai-Ago 2026'!BG17+'Set-Dez 2026'!BG17","v":0},{"$nulls":3},0,0,0,null,0,0,0,0,0,{"$f":"'Jan-Abr 2025'!BV17","v":0},{"$f":"'Jan-Abr 2025'!BU17+'Mai-Ago 2025'!BU17+'Set-Dez 2025'!BU17+'Jan-Abr 2026'!BU17+'Mai-Ago 2026'!BU17+'Set-Dez 2026'!BU17","v":0}]
["16h50 - 17h40",{"$nulls":34},"IME",0,0,0,50,0,0,0,0,0,{"$f":"'Jan-Abr 2025'!AT18","v":0},{"$f":"'Jan-Abr 2025'!AS18+'Mai-Ago 2025'!AS18+'Set-Dez 2025'!AS18+'Jan-Abr 2026'!AS18+'Mai-Ago 2026'!AS18+'Set-Dez 2026'!AS18","v":0},{"$nulls":3},0,0,0,null,0,0,0,0,0,{"$f":"'Jan-Abr 2025'!BH18","v":0},{"$f":"'Jan-Abr 2025'!BG18+'Mai-Ago 2025'!BG18+'Set-Dez 2025'!BG18+'Jan-Abr 2026'!BG18+'Mai-Ago 2026'!BG18+'Set-Dez 2026'!BG18","v":0},{"$nulls":3},0,0,0,null,0,0,0,0,0,{"$f":"'Jan-Abr 2025'!BV18","v":0},{"$f":"'Jan-Abr 2025'!BU18+'Mai-Ago 2025'!BU18+'Set-Dez 2025'!BU18+'Jan-Abr 2026'!BU18+'Mai-Ago 2026'!BU18+'Set-Dez 2026'!BU18","v":0}]
[{"$nulls":35},"ELE",0,0,0,50,0,0,0,0,0,{"$f":"'Jan-Abr 2025'!AT19","v":0},{"$f":"'Jan-Abr 2025'!AS19+'Mai-Ago 2025'!AS19+'Set-Dez 2025'!AS19+'Jan-Abr 2026'!AS19+'Mai-Ago 2026'!AS19+'Set-Dez 2026'!AS19","v":0},{"$nulls":3},0,0,0,null,0,0,0,0,0,{"$f":"'Jan-Abr 2025'!BH19","v":0},{"$f":"'Jan-Abr 2025'!BG19+'Mai-Ago 2025'!BG19+'Set-Dez 2025'!BG19+'Jan-Abr 2026'!BG19+'Mai-Ago 2026'!BG19+'Set-Dez 2026'!BG19","v":0},{"$nulls":3},0,0,0,null,0,0,0,0,0,{"$f":"'Jan-Abr 2025'!BV19","v":0},{"$f":"'Jan-Abr 2025'!BU19+'Mai-Ago 2025'!BU19+'Set-Dez 2025'!BU19+'Jan-Abr 2026'!BU19+'Mai-Ago 2026'!BU19+'Set-Dez 2026'!BU19","v":0}]
[{"$f":"A8+DAY(EOMONTH(A8,0))","v":"2026-10-01"},null,{"$f":"IF(C21<>\"\",CHOOSE(WEEKDAY(C21,1),\"Dom.\",\"Seg.\",\"Ter.\",\"Qua.\",\"Qui.\",\"Sex.\",\"Sáb.\"),\"\")","v":"Qui."},{"$f":"IF(D21<>\"\",CHOOSE(WEEKDAY(D21,1),\"Dom.\",\"Seg.\",\"Ter.\",\"Qua.\",\"Qui.\",\"Sex.\",\"Sáb.\"),\"\")","v":"Sex."},"Sáb.","Dom.","Seg.","Ter.","Qua.","Qui.","Sex.","Sáb.","Dom.","Seg.","Ter.","Qua.","Qui.","Sex.","Sáb.","Dom.","Seg.","Ter.","Qua.","Qui.","Sex.","Sáb.","Dom.","Seg.","Ter.","Qua.","Qui.","Sex.","Sáb.",null,null,"CP",0,0,0,25,0,0,0,0,0,{"$f":"'Jan-Abr 2025'!AT20","v":0},{"$f":"'Jan-Abr 2025'!AS20+'Mai-Ago 2025'!AS20+'Set-Dez 2025'!AS20+'Jan-Abr 2026'!AS20+'Mai-Ago 2026'!AS20+'Set-Dez 2026'!AS20","v":0},{"$nulls":3},0,0,0,null,0,0,0,0,0,{"$f":"'Jan-Abr 2025'!BH20","v":0},{"$f":"'Jan-Abr 2025'!BG20+'Mai-Ago 2025'!BG20+'Set-Dez 2025'!BG20+'Jan-Abr 2026'!BG20+'Mai-Ago 2026'!BG20+'Set-Dez 2026'!BG20","v":0},{"$nulls":3},0,0,0,null,0,0,0,0,0,{"$f":"'Jan-Abr 2025'!BV20","v":0},{"$f":"'Jan-Abr 2025'!BU20+'Mai-Ago 2025'!BU20+'Set-Dez 2025'!BU20+'Jan-Abr 2026'!BU20+'Mai-Ago 2026'!BU20+'Set-Dez 2026'!BU20","v":0}]
[null,null,{"$f":"A20","v":"2026-10-01"},{"$f":"IF(C21=\"\",\"\",IF(DAY(C21)<DAY(EOMONTH(C21,0)),C21+1,\"\"))","v":"2026-10-02"},"2026-10-03","2026-10-04","2026-10-05","2026-10-06","2026-10-07","2026-10-08","2026-10-09","2026-10-10","2026-10-11","2026-10-12","2026-10-13","2026-10-14","2026-10-15","2026-10-16","2026-10-17","2026-10-18","2026-10-19","2026-10-20","2026-10-21","2026-10-22","2026-10-23","2026-10-24","2026-10-25","2026-10-26","2026-10-27","2026-10-28","2026-10-29","2026-10-30","2026-10-31",null,null,"CH",0,0,0,25,0,0,0,0,0,{"$f":"'Jan-Abr 2025'!AT21","v":0},{"$f":"'Jan-Abr 2025'!AS21+'Mai-Ago 2025'!AS21+'Set-Dez 2025'!AS21+'Jan-Abr 2026'!AS21+'Mai-Ago 2026'!AS21+'Set-Dez 2026'!AS21","v":0},{"$nulls":3},0,0,0,null,0,0,0,0,0,{"$f":"'Jan-Abr 2025'!BH21","v":0},{"$f":"'Jan-Abr 2025'!BG21+'Mai-Ago 2025'!BG21+'Set-Dez 2025'!BG21+'Jan-Abr 2026'!BG21+'Mai-Ago 2026'!BG21+'Set-Dez 2026'!BG21","v":0},{"$nulls":3},0,0,0,null,0,0,0,0,0,{"$f":"'Jan-Abr 2025'!BV21","v":0},{"$f":"'Jan-Abr 2025'!BU21+'Mai-Ago 2025'!BU21+'Set-Dez 2025'!BU21+'Jan-Abr 2026'!BU21+'Mai-Ago 2026'!BU21+'Set-Dez 2026'!BU21","v":0}]
[{"$f":"A10","v":"09h00 - 09h50"},{"$nulls":34},"CLP",0,0,0,50,0,0,0,0,0,{"$f":"'Jan-Abr 2025'!AT22","v":0},{"$f":"'Jan-Abr 2025'!AS22+'Mai-Ago 2025'!AS22+'Set-Dez 2025'!AS22+'Jan-Abr 2026'!AS22+'Mai-Ago 2026'!AS22+'Set-Dez 2026'!AS22","v":0},{"$nulls":3},0,0,0,null,0,0,0,0,0,{"$f":"'Jan-Abr 2025'!BH22","v":0},{"$f":"'Jan-Abr 2025'!BG22+'Mai-Ago 2025'!BG22+'Set-Dez 2025'!BG22+'Jan-Abr 2026'!BG22+'Mai-Ago 2026'!BG22+'Set-Dez 2026'!BG22","v":0},{"$nulls":3},0,0,0,null,0,0,0,0,0,{"$f":"'Jan-Abr 2025'!BV22","v":0},{"$f":"'Jan-Abr 2025'!BU22+'Mai-Ago 2025'!BU22+'Set-Dez 2025'!BU22+'Jan-Abr 2026'!BU22+'Mai-Ago 2026'!BU22+'Set-Dez 2026'!BU22","v":0}]
[{"$f":"A11","v":"09h50 - 10h40"},{"$nulls":5},"Repúb.",{"$nulls":28},"DCM",0,0,0,50,0,0,0,0,0,{"$f":"'Jan-Abr 2025'!AT23","v":0},{"$f":"'Jan-Abr 2025'!AS23+'Mai-Ago 2025'!AS23+'Set-Dez 2025'!AS23+'Jan-Abr 2026'!AS23+'Mai-Ago 2026'!AS23+'Set-Dez 2026'!AS23","v":0},{"$nulls":3},0,0,0,null,0,0,0,0,0,{"$f":"'Jan-Abr 2025'!BH23","v":0},{"$f":"'Jan-Abr 2025'!BG23+'Mai-Ago 2025'!BG23+'Set-Dez 2025'!BG23+'Jan-Abr 2026'!BG23+'Mai-Ago 2026'!BG23+'Set-Dez 2026'!BG23","v":0},{"$nulls":3},0,0,0,null,0,0,0,0,0,{"$f":"'Jan-Abr 2025'!BV23","v":0},{"$f":"'Jan-Abr 2025'!BU23+'Mai-Ago 2025'!BU23+'Set-Dez 2025'!BU23+'Jan-Abr 2026'!BU23+'Mai-Ago 2026'!BU23+'Set-Dez 2026'!BU23","v":0}]
["11h00 - 11h50",{"$nulls":34},"CM",0,0,0,50,0,0,0,0,0,{"$f":"'Jan-Abr 2025'!AT24","v":0},{"$f":"'Jan-Abr 2025'!AS24+'Mai-Ago 2025'!AS24+'Set-Dez 2025'!AS24+'Jan-Abr 2026'!AS24+'Mai-Ago 2026'!AS24+'Set-Dez 2026'!AS24","v":0},{"$nulls":3},0,0,0,null,0,0,0,0,0,{"$f":"'Jan-Abr 2025'!BH24","v":0},{"$f":"'Jan-Abr 2025'!BG24+'Mai-Ago 2025'!BG24+'Set-Dez 2025'!BG24+'Jan-Abr 2026'!BG24+'Mai-Ago 2026'!BG24+'Set-Dez 2026'!BG24","v":0},{"$nulls":3},0,0,0,null,0,0,0,0,0,{"$f":"'Jan-Abr 2025'!BV24","v":0},{"$f":"'Jan-Abr 2025'!BU24+'Mai-Ago 2025'!BU24+'Set-Dez 2025'!BU24+'Jan-Abr 2026'!BU24+'Mai-Ago 2026'!BU24+'Set-Dez 2026'!BU24","v":0}]
["11h50 - 12h40",{"$nulls":34},"SD",0,0,0,50,0,0,0,0,0,{"$f":"'Jan-Abr 2025'!AT25","v":0},{"$f":"'Jan-Abr 2025'!AS25+'Mai-Ago 2025'!AS25+'Set-Dez 2025'!AS25+'Jan-Abr 2026'!AS25+'Mai-Ago 2026'!AS25+'Set-Dez 2026'!AS25","v":0},{"$nulls":3},0,0,0,null,0,0,0,0,0,{"$f":"'Jan-Abr 2025'!BH25","v":0},{"$f":"'Jan-Abr 2025'!BG25+'Mai-Ago 2025'!BG25+'Set-Dez 2025'!BG25+'Jan-Abr 2026'!BG25+'Mai-Ago 2026'!BG25+'Set-Dez 2026'!BG25","v":0},{"$nulls":3},0,0,0,null,0,0,0,0,0,{"$f":"'Jan-Abr 2025'!BV25","v":0},{"$f":"'Jan-Abr 2025'!BU25+'Mai-Ago 2025'!BU25+'Set-Dez 2025'!BU25+'Jan-Abr 2026'!BU25+'Mai-Ago 2026'!BU25+'Set-Dez 2026'!BU25","v":0}]
[{"$nulls":35},"OEM",0,0,0,50,0,0,0,0,0,{"$f":"'Jan-Abr 2025'!AT26","v":0},{"$f":"'Jan-Abr 2025'!AS26+'Mai-Ago 2025'!AS26+'Set-Dez 2025'!AS26+'Jan-Abr 2026'!AS26+'Mai-Ago 2026'!AS26+'Set-Dez 2026'!AS26","v":0},{"$nulls":3},0,0,0,null,0,0,0,0,0,{"$f":"'Jan-Abr 2025'!BH26","v":0},{"$f":"'Jan-Abr 2025'!BG26+'Mai-Ago 2025'!BG26+'Set-Dez 2025'!BG26+'Jan-Abr 2026'!BG26+'Mai-Ago 2026'!BG26+'Set-Dez 2026'!BG26","v":0},{"$nulls":3},0,0,0,null,0,0,0,0,0,{"$f":"'Jan-Abr 2025'!BV26","v":0},{"$f":"'Jan-Abr 2025'!BU26+'Mai-Ago 2025'!BU26+'Set-Dez 2025'!BU26+'Jan-Abr 2026'!BU26+'Mai-Ago 2026'!BU26+'Set-Dez 2026'!BU26","v":0}]
["14h00 - 14h50",{"$nulls":34},"GP",0,0,0,50,0,0,0,0,0,{"$f":"'Jan-Abr 2025'!AT27","v":0},{"$f":"'Jan-Abr 2025'!AS27+'Mai-Ago 2025'!AS27+'Set-Dez 2025'!AS27+'Jan-Abr 2026'!AS27+'Mai-Ago 2026'!AS27+'Set-Dez 2026'!AS27","v":0},{"$nulls":3},0,0,0,null,0,0,0,0,0,{"$f":"'Jan-Abr 2025'!BH27","v":0},{"$f":"'Jan-Abr 2025'!BG27+'Mai-Ago 2025'!BG27+'Set-Dez 2025'!BG27+'Jan-Abr 2026'!BG27+'Mai-Ago 2026'!BG27+'Set-Dez 2026'!BG27","v":0},{"$nulls":3},0,0,0,null,0,0,0,0,0,{"$f":"'Jan-Abr 2025'!BV27","v":0},{"$f":"'Jan-Abr 2025'!BU27+'Mai-Ago 2025'!BU27+'Set-Dez 2025'!BU27+'Jan-Abr 2026'!BU27+'Mai-Ago 2026'!BU27+'Set-Dez 2026'!BU27","v":0}]
["14h50 - 15h40",{"$nulls":34},"PP",0,0,0,50,0,0,0,0,0,{"$f":"'Jan-Abr 2025'!AT28","v":0},{"$f":"'Jan-Abr 2025'!AS28+'Mai-Ago 2025'!AS28+'Set-Dez 2025'!AS28+'Jan-Abr 2026'!AS28+'Mai-Ago 2026'!AS28+'Set-Dez 2026'!AS28","v":0},{"$nulls":3},0,0,0,null,0,0,0,0,0,{"$f":"'Jan-Abr 2025'!BH28","v":0},{"$f":"'Jan-Abr 2025'!BG28+'Mai-Ago 2025'!BG28+'Set-Dez 2025'!BG28+'Jan-Abr 2026'!BG28+'Mai-Ago 2026'!BG28+'Set-Dez 2026'!BG28","v":0},{"$nulls":3},0,0,0,null,0,0,0,0,0,{"$f":"'Jan-Abr 2025'!BV28","v":0},{"$f":"'Jan-Abr 2025'!BU28+'Mai-Ago 2025'!BU28+'Set-Dez 2025'!BU28+'Jan-Abr 2026'!BU28+'Mai-Ago 2026'!BU28+'Set-Dez 2026'!BU28","v":0}]
["16h00 - 16h50",{"$nulls":34},"GS",0,0,0,50,0,0,0,0,0,{"$f":"'Jan-Abr 2025'!AT29","v":0},{"$f":"'Jan-Abr 2025'!AS29+'Mai-Ago 2025'!AS29+'Set-Dez 2025'!AS29+'Jan-Abr 2026'!AS29+'Mai-Ago 2026'!AS29+'Set-Dez 2026'!AS29","v":0},{"$nulls":3},0,0,0,null,0,0,0,0,0,{"$f":"'Jan-Abr 2025'!BH29","v":0},{"$f":"'Jan-Abr 2025'!BG29+'Mai-Ago 2025'!BG29+'Set-Dez 2025'!BG29+'Jan-Abr 2026'!BG29+'Mai-Ago 2026'!BG29+'Set-Dez 2026'!BG29","v":0},{"$nulls":3},0,0,0,null,0,0,0,0,0,{"$f":"'Jan-Abr 2025'!BV29","v":0},{"$f":"'Jan-Abr 2025'!BU29+'Mai-Ago 2025'!BU29+'Set-Dez 2025'!BU29+'Jan-Abr 2026'!BU29+'Mai-Ago 2026'!BU29+'Set-Dez 2026'!BU29","v":0}]
["16h50 - 17h40",{"$nulls":34},"CGO",0,0,0,50,0,0,0,0,0,{"$f":"'Jan-Abr 2025'!AT30","v":0},{"$f":"'Jan-Abr 2025'!AS30+'Mai-Ago 2025'!AS30+'Set-Dez 2025'!AS30+'Jan-Abr 2026'!AS30+'Mai-Ago 2026'!AS30+'Set-Dez 2026'!AS30","v":0},{"$nulls":3},0,0,0,null,0,0,0,0,0,{"$f":"'Jan-Abr 2025'!BH30","v":0},{"$f":"'Jan-Abr 2025'!BG30+'Mai-Ago 2025'!BG30+'Set-Dez 2025'!BG30+'Jan-Abr 2026'!BG30+'Mai-Ago 2026'!BG30+'Set-Dez 2026'!BG30","v":0},{"$nulls":3},0,0,0,null,0,0,0,0,0,{"$f":"'Jan-Abr 2025'!BV30","v":0},{"$f":"'Jan-Abr 2025'!BU30+'Mai-Ago 2025'!BU30+'Set-Dez 2025'!BU30+'Jan-Abr 2026'!BU30+'Mai-Ago 2026'!BU30+'Set-Dez 2026'!BU30","v":0}]
[{"$nulls":35},"LOG",0,0,0,50,0,0,0,0,0,{"$f":"'Jan-Abr 2025'!AT31","v":0},{"$f":"'Jan-Abr 2025'!AS31+'Mai-Ago 2025'!AS31+'Set-Dez 2025'!AS31+'Jan-Abr 2026'!AS31+'Mai-Ago 2026'!AS31+'Set-Dez 2026'!AS31","v":0},{"$nulls":3},0,0,0,null,0,0,0,0,0,{"$f":"'Jan-Abr 2025'!BH31","v":0},{"$f":"'Jan-Abr 2025'!BG31+'Mai-Ago 2025'!BG31+'Set-Dez 2025'!BG31+'Jan-Abr 2026'!BG31+'Mai-Ago 2026'!BG31+'Set-Dez 2026'!BG31","v":0},{"$nulls":3},0,0,0,null,0,0,0,0,0,{"$f":"'Jan-Abr 2025'!BV31","v":0},{"$f":"'Jan-Abr 2025'!BU31+'Mai-Ago 2025'!BU31+'Set-Dez 2025'!BU31+'Jan-Abr 2026'!BU31+'Mai-Ago 2026'!BU31+'Set-Dez 2026'!BU31","v":0}]
[{"$f":"A20+DAY(EOMONTH(A20,0))","v":"2026-11-01"},null,{"$f":"IF(C33<>\"\",CHOOSE(WEEKDAY(C33,1),\"Dom.\",\"Seg.\",\"Ter.\",\"Qua.\",\"Qui.\",\"Sex.\",\"Sáb.\"),\"\")","v":"Dom."},{"$f":"IF(D33<>\"\",CHOOSE(WEEKDAY(D33,1),\"Dom.\",\"Seg.\",\"Ter.\",\"Qua.\",\"Qui.\",\"Sex.\",\"Sáb.\"),\"\")","v":"Seg."},"Ter.","Qua.","Qui.","Sex.","Sáb.","Dom.","Seg.","Ter.","Qua.","Qui.","Sex.","Sáb.","Dom.","Seg.","Ter.","Qua.","Qui.","Sex.","Sáb.","Dom.","Seg.","Ter.","Qua.","Qui.","Sex.","Sáb.","Dom.","Seg.","",null,null,"MOT",0,0,0,50,0,0,0,0,0,{"$f":"'Jan-Abr 2025'!AT32","v":0},{"$f":"'Jan-Abr 2025'!AS32+'Mai-Ago 2025'!AS32+'Set-Dez 2025'!AS32+'Jan-Abr 2026'!AS32+'Mai-Ago 2026'!AS32+'Set-Dez 2026'!AS32","v":0},{"$nulls":3},0,0,0,null,0,0,0,0,0,{"$f":"'Jan-Abr 2025'!BH32","v":0},{"$f":"'Jan-Abr 2025'!BG32+'Mai-Ago 2025'!BG32+'Set-Dez 2025'!BG32+'Jan-Abr 2026'!BG32+'Mai-Ago 2026'!BG32+'Set-Dez 2026'!BG32","v":0},{"$nulls":3},0,0,0,null,0,0,0,0,0,{"$f":"'Jan-Abr 2025'!BV32","v":0},{"$f":"'Jan-Abr 2025'!BU32+'Mai-Ago 2025'!BU32+'Set-Dez 2025'!BU32+'Jan-Abr 2026'!BU32+'Mai-Ago 2026'!BU32+'Set-Dez 2026'!BU32","v":0}]
[null,null,{"$f":"A32","v":"2026-11-01"},{"$f":"IF(C33=\"\",\"\",IF(DAY(C33)<DAY(EOMONTH(C33,0)),C33+1,\"\"))","v":"2026-11-02"},"2026-11-03","2026-11-04","2026-11-05","2026-11-06","2026-11-07","2026-11-08","2026-11-09","2026-11-10","2026-11-11","2026-11-12","2026-11-13","2026-11-14","2026-11-15","2026-11-16","2026-11-17","2026-11-18","2026-11-19","2026-11-20","2026-11-21","2026-11-22","2026-11-23","2026-11-24","2026-11-25","2026-11-26","2026-11-27","2026-11-28","2026-11-29","2026-11-30","",null,null,"SGI",0,0,0,25,0,0,0,0,0,{"$f":"'Jan-Abr 2025'!AT33","v":0},{"$f":"'Jan-Abr 2025'!AS33+'Mai-Ago 2025'!AS33+'Set-Dez 2025'!AS33+'Jan-Abr 2026'!AS33+'Mai-Ago 2026'!AS33+'Set-Dez 2026'!AS33","v":0},{"$nulls":3},0,0,0,null,0,0,0,0,0,{"$f":"'Jan-Abr 2025'!BH33","v":0},{"$f":"'Jan-Abr 2025'!BG33+'Mai-Ago 2025'!BG33+'Set-Dez 2025'!BG33+'Jan-Abr 2026'!BG33+'Mai-Ago 2026'!BG33+'Set-Dez 2026'!BG33","v":0},{"$nulls":3},0,0,0,null,0,0,0,0,0,{"$f":"'Jan-Abr 2025'!BV33","v":0},{"$f":"'Jan-Abr 2025'!BU33+'Mai-Ago 2025'!BU33+'Set-Dez 2025'!BU33+'Jan-Abr 2026'!BU33+'Mai-Ago 2026'!BU33+'Set-Dez 2026'!BU33","v":0}]
[{"$f":"A22","v":"09h00 - 09h50"},{"$nulls":34},"QCEP",0,0,0,50,0,0,0,0,0,{"$f":"'Jan-Abr 2025'!AT34","v":0},{"$f":"'Jan-Abr 2025'!AS34+'Mai-Ago 2025'!AS34+'Set-Dez 2025'!AS34+'Jan-Abr 2026'!AS34+'Mai-Ago 2026'!AS34+'Set-Dez 2026'!AS34","v":0},{"$nulls":3},0,0,0,null,0,0,0,0,0,{"$f":"'Jan-Abr 2025'!BH34","v":0},{"$f":"'Jan-Abr 2025'!BG34+'Mai-Ago 2025'!BG34+'Set-Dez 2025'!BG34+'Jan-Abr 2026'!BG34+'Mai-Ago 2026'!BG34+'Set-Dez 2026'!BG34","v":0},{"$nulls":3},0,0,0,null,0,0,0,0,0,{"$f":"'Jan-Abr 2025'!BV34","v":0},{"$f":"'Jan-Abr 2025'!BU34+'Mai-Ago 2025'!BU34+'Set-Dez 2025'!BU34+'Jan-Abr 2026'!BU34+'Mai-Ago 2026'!BU34+'Set-Dez 2026'!BU34","v":0}]
[{"$f":"A23","v":"09h50 - 10h40"},null,"Todos",{"$nulls":9},"São",{"$nulls":23},0,0,0,null,0,0,0,0,0,{"$f":"'Jan-Abr 2025'!AT35","v":0},{"$f":"'Jan-Abr 2025'!AS35+'Mai-Ago 2025'!AS35+'Set-Dez 2025'!AS35+'Jan-Abr 2026'!AS35+'Mai-Ago 2026'!AS35+'Set-Dez 2026'!AS35","v":0},{"$nulls":3},0,0,0,null,0,0,0,0,0,{"$f":"'Jan-Abr 2025'!BH35","v":0},{"$f":"'Jan-Abr 2025'!BG35+'Mai-Ago 2025'!BG35+'Set-Dez 2025'!BG35+'Jan-Abr 2026'!BG35+'Mai-Ago 2026'!BG35+'Set-Dez 2026'!BG35","v":0},{"$nulls":3},0,0,0,null,0,0,0,0,0,{"$f":"'Jan-Abr 2025'!BV35","v":0},{"$f":"'Jan-Abr 2025'!BU35+'Mai-Ago 2025'!BU35+'Set-Dez 2025'!BU35+'Jan-Abr 2026'!BU35+'Mai-Ago 2026'!BU35+'Set-Dez 2026'!BU35","v":0}]
["11h00 - 11h50",null,"Santos",{"$nulls":9},"Marti.",{"$nulls":23},0,0,0,null,0,0,0,0,0,{"$f":"'Jan-Abr 2025'!AT36","v":0},{"$f":"'Jan-Abr 2025'!AS36+'Mai-Ago 2025'!AS36+'Set-Dez 2025'!AS36+'Jan-Abr 2026'!AS36+'Mai-Ago 2026'!AS36+'Set-Dez 2026'!AS36","v":0},{"$nulls":3},0,0,0,null,0,0,0,0,0,{"$f":"'Jan-Abr 2025'!BH36","v":0},{"$f":"'Jan-Abr 2025'!BG36+'Mai-Ago 2025'!BG36+'Set-Dez 2025'!BG36+'Jan-Abr 2026'!BG36+'Mai-Ago 2026'!BG36+'Set-Dez 2026'!BG36","v":0},{"$nulls":3},0,0,0,null,0,0,0,0,0,{"$f":"'Jan-Abr 2025'!BV36","v":0},{"$f":"'Jan-Abr 2025'!BU36+'Mai-Ago 2025'!BU36+'Set-Dez 2025'!BU36+'Jan-Abr 2026'!BU36+'Mai-Ago 2026'!BU36+'Set-Dez 2026'!BU36","v":0}]
["11h50 - 12h40",{"$nulls":35},0,0,0,null,0,0,0,0,0,{"$f":"'Jan-Abr 2025'!AT37","v":0},{"$f":"'Jan-Abr 2025'!AS37+'Mai-Ago 2025'!AS37+'Set-Dez 2025'!AS37+'Jan-Abr 2026'!AS37+'Mai-Ago 2026'!AS37+'Set-Dez 2026'!AS37","v":0},{"$nulls":3},0,0,0,null,0,0,0,0,0,{"$f":"'Jan-Abr 2025'!BH37","v":0},{"$f":"'Jan-Abr 2025'!BG37+'Mai-Ago 2025'!BG37+'Set-Dez 2025'!BG37+'Jan-Abr 2026'!BG37+'Mai-Ago 2026'!BG37+'Set-Dez 2026'!BG37","v":0},{"$nulls":3},0,0,0,null,0,0,0,0,0,{"$f":"'Jan-Abr 2025'!BV37","v":0},{"$f":"'Jan-Abr 2025'!BU37+'Mai-Ago 2025'!BU37+'Set-Dez 2025'!BU37+'Jan-Abr 2026'!BU37+'Mai-Ago 2026'!BU37+'Set-Dez 2026'!BU37","v":0}]
[{"$nulls":36},0,0,0,null,0,0,0,0,0,{"$f":"'Jan-Abr 2025'!AT38","v":0},{"$f":"'Jan-Abr 2025'!AS38+'Mai-Ago 2025'!AS38+'Set-Dez 2025'!AS38+'Jan-Abr 2026'!AS38+'Mai-Ago 2026'!AS38+'Set-Dez 2026'!AS38","v":0},{"$nulls":3},0,0,0,null,0,0,0,0,0,{"$f":"'Jan-Abr 2025'!BH38","v":0},{"$f":"'Jan-Abr 2025'!BG38+'Mai-Ago 2025'!BG38+'Set-Dez 2025'!BG38+'Jan-Abr 2026'!BG38+'Mai-Ago 2026'!BG38+'Set-Dez 2026'!BG38","v":0},{"$nulls":3},0,0,0,null,0,0,0,0,0,{"$f":"'Jan-Abr 2025'!BV38","v":0},{"$f":"'Jan-Abr 2025'!BU38+'Mai-Ago 2025'!BU38+'Set-Dez 2025'!BU38+'Jan-Abr 2026'!BU38+'Mai-Ago 2026'!BU38+'Set-Dez 2026'!BU38","v":0}]
["14h00 - 14h50",{"$nulls":35},0,0,0,null,0,0,0,0,0,{"$f":"'Jan-Abr 2025'!AT39","v":0},{"$f":"'Jan-Abr 2025'!AS39+'Mai-Ago 2025'!AS39+'Set-Dez 2025'!AS39+'Jan-Abr 2026'!AS39+'Mai-Ago 2026'!AS39+'Set-Dez 2026'!AS39","v":0},{"$nulls":3},0,0,0,null,0,0,0,0,0,{"$f":"'Jan-Abr 2025'!BH39","v":0},{"$f":"'Jan-Abr 2025'!BG39+'Mai-Ago 2025'!BG39+'Set-Dez 2025'!BG39+'Jan-Abr 2026'!BG39+'Mai-Ago 2026'!BG39+'Set-Dez 2026'!BG39","v":0},{"$nulls":3},0,0,0,null,0,0,0,0,0,{"$f":"'Jan-Abr 2025'!BV39","v":0},{"$f":"'Jan-Abr 2025'!BU39+'Mai-Ago 2025'!BU39+'Set-Dez 2025'!BU39+'Jan-Abr 2026'!BU39+'Mai-Ago 2026'!BU39+'Set-Dez 2026'!BU39","v":0}]
["14h50 - 15h40",{"$nulls":35},0,0,0,null,0,0,0,0,{"$f":"SUM(AO40:AR40)","v":0},{"$f":"'Jan-Abr 2025'!AT40","v":0},{"$f":"'Jan-Abr 2025'!AS40+'Mai-Ago 2025'!AS40+'Set-Dez 2025'!AS40+'Jan-Abr 2026'!AS40+'Mai-Ago 2026'!AS40+'Set-Dez 2026'!AS40","v":0},{"$nulls":3},0,0,0,null,0,0,0,0,0,{"$f":"'Jan-Abr 2025'!BH40","v":0},{"$f":"'Jan-Abr 2025'!BG40+'Mai-Ago 2025'!BG40+'Set-Dez 2025'!BG40+'Jan-Abr 2026'!BG40+'Mai-Ago 2026'!BG40+'Set-Dez 2026'!BG40","v":0},{"$nulls":3},0,0,0,null,0,0,0,0,{"$f":"SUM(BQ40:BT40)","v":0},{"$f":"'Jan-Abr 2025'!BV40","v":0},{"$f":"'Jan-Abr 2025'!BU40+'Mai-Ago 2025'!BU40+'Set-Dez 2025'!BU40+'Jan-Abr 2026'!BU40+'Mai-Ago 2026'!BU40+'Set-Dez 2026'!BU40","v":0}]
["16h00 - 16h50",{"$nulls":35},0,0,0,null,0,0,0,0,0,{"$f":"'Jan-Abr 2025'!AT41","v":0},{"$f":"'Jan-Abr 2025'!AS41+'Mai-Ago 2025'!AS41+'Set-Dez 2025'!AS41+'Jan-Abr 2026'!AS41+'Mai-Ago 2026'!AS41+'Set-Dez 2026'!AS41","v":0},{"$nulls":3},0,0,0,null,0,0,0,0,0,{"$f":"'Jan-Abr 2025'!BH41","v":0},{"$f":"'Jan-Abr 2025'!BG41+'Mai-Ago 2025'!BG41+'Set-Dez 2025'!BG41+'Jan-Abr 2026'!BG41+'Mai-Ago 2026'!BG41+'Set-Dez 2026'!BG41","v":0},{"$nulls":3},0,0,0,null,0,0,0,0,0,{"$f":"'Jan-Abr 2025'!BV41","v":0},{"$f":"'Jan-Abr 2025'!BU41+'Mai-Ago 2025'!BU41+'Set-Dez 2025'!BU41+'Jan-Abr 2026'!BU41+'Mai-Ago 2026'!BU41+'Set-Dez 2026'!BU41","v":0}]
["16h50 - 17h40",{"$nulls":35},0,0,0,null,0,0,0,0,0,{"$f":"'Jan-Abr 2025'!AT42","v":0},{"$f":"'Jan-Abr 2025'!AS42+'Mai-Ago 2025'!AS42+'Set-Dez 2025'!AS42+'Jan-Abr 2026'!AS42+'Mai-Ago 2026'!AS42+'Set-Dez 2026'!AS42","v":0},{"$nulls":3},0,0,0,null,0,0,0,0,0,{"$f":"'Jan-Abr 2025'!BH42","v":0},{"$f":"'Jan-Abr 2025'!BG42+'Mai-Ago 2025'!BG42+'Set-Dez 2025'!BG42+'Jan-Abr 2026'!BG42+'Mai-Ago 2026'!BG42+'Set-Dez 2026'!BG42","v":0},{"$nulls":3},0,0,0,null,0,0,0,0,0,{"$f":"'Jan-Abr 2025'!BV42","v":0},{"$f":"'Jan-Abr 2025'!BU42+'Mai-Ago 2025'!BU42+'Set-Dez 2025'!BU42+'Jan-Abr 2026'!BU42+'Mai-Ago 2026'!BU42+'Set-Dez 2026'!BU42","v":0}]
[{"$nulls":36},0,0,0,null,0,0,0,0,0,{"$f":"'Jan-Abr 2025'!AT43","v":0},{"$f":"'Jan-Abr 2025'!AS43+'Mai-Ago 2025'!AS43+'Set-Dez 2025'!AS43+'Jan-Abr 2026'!AS43+'Mai-Ago 2026'!AS43+'Set-Dez 2026'!AS43","v":0},{"$nulls":3},0,0,0,null,0,0,0,0,0,{"$f":"'Jan-Abr 2025'!BH43","v":0},{"$f":"'Jan-Abr 2025'!BG43+'Mai-Ago 2025'!BG43+'Set-Dez 2025'!BG43+'Jan-Abr 2026'!BG43+'Mai-Ago 2026'!BG43+'Set-Dez 2026'!BG43","v":0},{"$nulls":3},0,0,0,null,0,0,0,0,0,{"$f":"'Jan-Abr 2025'!BV43","v":0},{"$f":"'Jan-Abr 2025'!BU43+'Mai-Ago 2025'!BU43+'Set-Dez 2025'!BU43+'Jan-Abr 2026'!BU43+'Mai-Ago 2026'!BU43+'Set-Dez 2026'!BU43","v":0}]
[{"$f":"A32+DAY(EOMONTH(A32,0))","v":"2026-12-01"},null,{"$f":"IF(C45<>\"\",CHOOSE(WEEKDAY(C45,1),\"Dom.\",\"Seg.\",\"Ter.\",\"Qua.\",\"Qui.\",\"Sex.\",\"Sáb.\"),\"\")","v":"Ter."},{"$f":"IF(D45<>\"\",CHOOSE(WEEKDAY(D45,1),\"Dom.\",\"Seg.\",\"Ter.\",\"Qua.\",\"Qui.\",\"Sex.\",\"Sáb.\"),\"\")","v":"Qua."},"Qui.","Sex.","Sáb.","Dom.","Seg.","Ter.","Qua.","Qui.","Sex.","Sáb.","Dom.","Seg.","Ter.","Qua.","Qui.","Sex.","Sáb.","Dom.","Seg.","Ter.","Qua.","Qui.","Sex.","Sáb.","Dom.","Seg.","Ter.","Qua.","Qui.",{"$nulls":3},0,0,0,null,0,0,0,0,0,{"$f":"'Jan-Abr 2025'!AT44","v":0},{"$f":"'Jan-Abr 2025'!AS44+'Mai-Ago 2025'!AS44+'Set-Dez 2025'!AS44+'Jan-Abr 2026'!AS44+'Mai-Ago 2026'!AS44+'Set-Dez 2026'!AS44","v":0},{"$nulls":3},0,0,0,null,0,0,0,0,0,{"$f":"'Jan-Abr 2025'!BH44","v":0},{"$f":"'Jan-Abr 2025'!BG44+'Mai-Ago 2025'!BG44+'Set-Dez 2025'!BG44+'Jan-Abr 2026'!BG44+'Mai-Ago 2026'!BG44+'Set-Dez 2026'!BG44","v":0},{"$nulls":3},0,0,0,null,0,0,0,0,0,{"$f":"'Jan-Abr 2025'!BV44","v":0},{"$f":"'Jan-Abr 2025'!BU44+'Mai-Ago 2025'!BU44+'Set-Dez 2025'!BU44+'Jan-Abr 2026'!BU44+'Mai-Ago 2026'!BU44+'Set-Dez 2026'!BU44","v":0}]
[null,null,{"$f":"A44","v":"2026-12-01"},{"$f":"IF(C45=\"\",\"\",IF(DAY(C45)<DAY(EOMONTH(C45,0)),C45+1,\"\"))","v":"2026-12-02"},"2026-12-03","2026-12-04","2026-12-05","2026-12-06","2026-12-07","2026-12-08","2026-12-09","2026-12-10","2026-12-11","2026-12-12","2026-12-13","2026-12-14","2026-12-15","2026-12-16","2026-12-17","2026-12-18","2026-12-19","2026-12-20","2026-12-21","2026-12-22","2026-12-23","2026-12-24","2026-12-25","2026-12-26","2026-12-27","2026-12-28","2026-12-29","2026-12-30","2026-12-31",{"$nulls":3},0,0,0,null,0,0,0,0,0,{"$f":"'Jan-Abr 2025'!AT45","v":0},{"$f":"'Jan-Abr 2025'!AS45+'Mai-Ago 2025'!AS45+'Set-Dez 2025'!AS45+'Jan-Abr 2026'!AS45+'Mai-Ago 2026'!AS45+'Set-Dez 2026'!AS45","v":0},{"$nulls":3},0,0,0,null,0,0,0,0,0,{"$f":"'Jan-Abr 2025'!BH45","v":0},{"$f":"'Jan-Abr 2025'!BG45+'Mai-Ago 2025'!BG45+'Set-Dez 2025'!BG45+'Jan-Abr 2026'!BG45+'Mai-Ago 2026'!BG45+'Set-Dez 2026'!BG45","v":0},{"$nulls":3},0,0,0,null,0,0,0,0,0,{"$f":"'Jan-Abr 2025'!BV45","v":0},{"$f":"'Jan-Abr 2025'!BU45+'Mai-Ago 2025'!BU45+'Set-Dez 2025'!BU45+'Jan-Abr 2026'!BU45+'Mai-Ago 2026'!BU45+'Set-Dez 2026'!BU45","v":0}]
[{"$f":"A10","v":"09h00 - 09h50"},{"$nulls":35},0,0,0,null,0,0,0,0,0,{"$f":"'Jan-Abr 2025'!AT46","v":0},{"$f":"'Jan-Abr 2025'!AS46+'Mai-Ago 2025'!AS46+'Set-Dez 2025'!AS46+'Jan-Abr 2026'!AS46+'Mai-Ago 2026'!AS46+'Set-Dez 2026'!AS46","v":0},{"$nulls":3},0,0,0,null,0,0,0,0,0,{"$f":"'Jan-Abr 2025'!BH46","v":0},{"$f":"'Jan-Abr 2025'!BG46+'Mai-Ago 2025'!BG46+'Set-Dez 2025'!BG46+'Jan-Abr 2026'!BG46+'Mai-Ago 2026'!BG46+'Set-Dez 2026'!BG46","v":0},{"$nulls":3},0,0,0,null,0,0,0,0,0,{"$f":"'Jan-Abr 2025'!BV46","v":0},{"$f":"'Jan-Abr 2025'!BU46+'Mai-Ago 2025'!BU46+'Set-Dez 2025'!BU46+'Jan-Abr 2026'!BU46+'Mai-Ago 2026'!BU46+'Set-Dez 2026'!BU46","v":0}]
[{"$f":"A11","v":"09h50 - 10h40"},null,"Rest.",{"$nulls":6},"Imacu.",{"$nulls":16},"Natal",{"$nulls":9},0,0,0,null,0,0,0,0,0,{"$f":"'Jan-Abr 2025'!AT47","v":0},{"$f":"'Jan-Abr 2025'!AS47+'Mai-Ago 2025'!AS47+'Set-Dez 2025'!AS47+'Jan-Abr 2026'!AS47+'Mai-Ago 2026'!AS47+'Set-Dez 2026'!AS47","v":0},{"$nulls":3},0,0,0,null,0,0,0,0,0,{"$f":"'Jan-Abr 2025'!BH47","v":0},{"$f":"'Jan-Abr 2025'!BG47+'Mai-Ago 2025'!BG47+'Set-Dez 2025'!BG47+'Jan-Abr 2026'!BG47+'Mai-Ago 2026'!BG47+'Set-Dez 2026'!BG47","v":0},{"$nulls":3},0,0,0,null,0,0,0,0,0,{"$f":"'Jan-Abr 2025'!BV47","v":0},{"$f":"'Jan-Abr 2025'!BU47+'Mai-Ago 2025'!BU47+'Set-Dez 2025'!BU47+'Jan-Abr 2026'!BU47+'Mai-Ago 2026'!BU47+'Set-Dez 2026'!BU47","v":0}]
["11h00 - 11h50",null,"Indep.",{"$nulls":6},"Concei.",{"$nulls":26},0,0,0,null,0,0,0,0,0,{"$f":"'Jan-Abr 2025'!AT48","v":0},{"$f":"'Jan-Abr 2025'!AS48+'Mai-Ago 2025'!AS48+'Set-Dez 2025'!AS48+'Jan-Abr 2026'!AS48+'Mai-Ago 2026'!AS48+'Set-Dez 2026'!AS48","v":0},{"$nulls":3},0,0,0,null,0,0,0,0,0,{"$f":"'Jan-Abr 2025'!BH48","v":0},{"$f":"'Jan-Abr 2025'!BG48+'Mai-Ago 2025'!BG48+'Set-Dez 2025'!BG48+'Jan-Abr 2026'!BG48+'Mai-Ago 2026'!BG48+'Set-Dez 2026'!BG48","v":0},{"$nulls":3},0,0,0,null,0,0,0,0,0,{"$f":"'Jan-Abr 2025'!BV48","v":0},{"$f":"'Jan-Abr 2025'!BU48+'Mai-Ago 2025'!BU48+'Set-Dez 2025'!BU48+'Jan-Abr 2026'!BU48+'Mai-Ago 2026'!BU48+'Set-Dez 2026'!BU48","v":0}]
["11h50 - 12h40",{"$nulls":35},0,0,0,null,0,0,0,0,0,{"$f":"'Jan-Abr 2025'!AT49","v":0},{"$f":"'Jan-Abr 2025'!AS49+'Mai-Ago 2025'!AS49+'Set-Dez 2025'!AS49+'Jan-Abr 2026'!AS49+'Mai-Ago 2026'!AS49+'Set-Dez 2026'!AS49","v":0},{"$nulls":3},0,0,0,null,0,0,0,0,0,{"$f":"'Jan-Abr 2025'!BH49","v":0},{"$f":"'Jan-Abr 2025'!BG49+'Mai-Ago 2025'!BG49+'Set-Dez 2025'!BG49+'Jan-Abr 2026'!BG49+'Mai-Ago 2026'!BG49+'Set-Dez 2026'!BG49","v":0},{"$nulls":3},0,0,0,null,0,0,0,0,0,{"$f":"'Jan-Abr 2025'!BV49","v":0},{"$f":"'Jan-Abr 2025'!BU49+'Mai-Ago 2025'!BU49+'Set-Dez 2025'!BU49+'Jan-Abr 2026'!BU49+'Mai-Ago 2026'!BU49+'Set-Dez 2026'!BU49","v":0}]
[{"$nulls":36},0,0,0,null,0,0,0,0,0,{"$f":"'Jan-Abr 2025'!AT50","v":0},{"$f":"'Jan-Abr 2025'!AS50+'Mai-Ago 2025'!AS50+'Set-Dez 2025'!AS50+'Jan-Abr 2026'!AS50+'Mai-Ago 2026'!AS50+'Set-Dez 2026'!AS50","v":0},{"$nulls":3},0,0,0,null,0,0,0,0,0,{"$f":"'Jan-Abr 2025'!BH50","v":0},{"$f":"'Jan-Abr 2025'!BG50+'Mai-Ago 2025'!BG50+'Set-Dez 2025'!BG50+'Jan-Abr 2026'!BG50+'Mai-Ago 2026'!BG50+'Set-Dez 2026'!BG50","v":0},{"$nulls":3},0,0,0,null,0,0,0,0,0,{"$f":"'Jan-Abr 2025'!BV50","v":0},{"$f":"'Jan-Abr 2025'!BU50+'Mai-Ago 2025'!BU50+'Set-Dez 2025'!BU50+'Jan-Abr 2026'!BU50+'Mai-Ago 2026'!BU50+'Set-Dez 2026'!BU50","v":0}]
["14h00 - 14h50",{"$nulls":35},0,0,0,null,0,0,0,0,0,{"$f":"'Jan-Abr 2025'!AT51","v":0},{"$f":"'Jan-Abr 2025'!AS51+'Mai-Ago 2025'!AS51+'Set-Dez 2025'!AS51+'Jan-Abr 2026'!AS51+'Mai-Ago 2026'!AS51+'Set-Dez 2026'!AS51","v":0},{"$nulls":3},0,0,0,null,0,0,0,0,0,{"$f":"'Jan-Abr 2025'!BH51","v":0},{"$f":"'Jan-Abr 2025'!BG51+'Mai-Ago 2025'!BG51+'Set-Dez 2025'!BG51+'Jan-Abr 2026'!BG51+'Mai-Ago 2026'!BG51+'Set-Dez 2026'!BG51","v":0},{"$nulls":3},0,0,0,null,0,0,0,0,0,{"$f":"'Jan-Abr 2025'!BV51","v":0},{"$f":"'Jan-Abr 2025'!BU51+'Mai-Ago 2025'!BU51+'Set-Dez 2025'!BU51+'Jan-Abr 2026'!BU51+'Mai-Ago 2026'!BU51+'Set-Dez 2026'!BU51","v":0}]
["14h50 - 15h40",{"$nulls":35},0,0,0,null,0,0,0,0,0,{"$f":"'Jan-Abr 2025'!AT52","v":0},{"$f":"'Jan-Abr 2025'!AS52+'Mai-Ago 2025'!AS52+'Set-Dez 2025'!AS52+'Jan-Abr 2026'!AS52+'Mai-Ago 2026'!AS52+'Set-Dez 2026'!AS52","v":0},{"$nulls":3},0,0,0,null,0,0,0,0,0,{"$f":"'Jan-Abr 2025'!BH52","v":0},{"$f":"'Jan-Abr 2025'!BG52+'Mai-Ago 2025'!BG52+'Set-Dez 2025'!BG52+'Jan-Abr 2026'!BG52+'Mai-Ago 2026'!BG52+'Set-Dez 2026'!BG52","v":0},{"$nulls":3},0,0,0,null,0,0,0,0,0,{"$f":"'Jan-Abr 2025'!BV52","v":0},{"$f":"'Jan-Abr 2025'!BU52+'Mai-Ago 2025'!BU52+'Set-Dez 2025'!BU52+'Jan-Abr 2026'!BU52+'Mai-Ago 2026'!BU52+'Set-Dez 2026'!BU52","v":0}]
["16h00 - 16h50",{"$nulls":35},0,0,0,null,0,0,0,0,0,{"$f":"'Jan-Abr 2025'!AT53","v":0},{"$f":"'Jan-Abr 2025'!AS53+'Mai-Ago 2025'!AS53+'Set-Dez 2025'!AS53+'Jan-Abr 2026'!AS53+'Mai-Ago 2026'!AS53+'Set-Dez 2026'!AS53","v":0},{"$nulls":3},0,0,0,null,0,0,0,0,0,{"$f":"'Jan-Abr 2025'!BH53","v":0},{"$f":"'Jan-Abr 2025'!BG53+'Mai-Ago 2025'!BG53+'Set-Dez 2025'!BG53+'Jan-Abr 2026'!BG53+'Mai-Ago 2026'!BG53+'Set-Dez 2026'!BG53","v":0},{"$nulls":3},0,0,0,null,0,0,0,0,0,{"$f":"'Jan-Abr 2025'!BV53","v":0},{"$f":"'Jan-Abr 2025'!BU53+'Mai-Ago 2025'!BU53+'Set-Dez 2025'!BU53+'Jan-Abr 2026'!BU53+'Mai-Ago 2026'!BU53+'Set-Dez 2026'!BU53","v":0}]
["16h50 - 17h40",{"$nulls":35},0,0,0,null,0,0,0,0,0,{"$f":"'Jan-Abr 2025'!AT54","v":0},{"$f":"'Jan-Abr 2025'!AS54+'Mai-Ago 2025'!AS54+'Set-Dez 2025'!AS54+'Jan-Abr 2026'!AS54+'Mai-Ago 2026'!AS54+'Set-Dez 2026'!AS54","v":0},{"$nulls":3},0,0,0,null,0,0,0,0,0,{"$f":"'Jan-Abr 2025'!BH54","v":0},{"$f":"'Jan-Abr 2025'!BG54+'Mai-Ago 2025'!BG54+'Set-Dez 2025'!BG54+'Jan-Abr 2026'!BG54+'Mai-Ago 2026'!BG54+'Set-Dez 2026'!BG54","v":0},{"$nulls":3},0,0,0,null,0,0,0,0,0,{"$f":"'Jan-Abr 2025'!BV54","v":0},{"$f":"'Jan-Abr 2025'!BU54+'Mai-Ago 2025'!BU54+'Set-Dez 2025'!BU54+'Jan-Abr 2026'!BU54+'Mai-Ago 2026'!BU54+'Set-Dez 2026'!BU54","v":0}]
[{"$nulls":32},"Fim",null,null,"PCT",0,0,0,560,0,0,0,0,0,{"$f":"'Jan-Abr 2025'!AT55","v":0},{"$f":"'Jan-Abr 2025'!AS55+'Mai-Ago 2025'!AS55+'Set-Dez 2025'!AS55+'Jan-Abr 2026'!AS55+'Mai-Ago 2026'!AS55+'Set-Dez 2026'!AS55","v":0},{"$nulls":3},0,0,0,null,0,0,0,0,0,{"$f":"'Jan-Abr 2025'!BH55","v":0},{"$f":"'Jan-Abr 2025'!BG55+'Mai-Ago 2025'!BG55+'Set-Dez 2025'!BG55+'Jan-Abr 2026'!BG55+'Mai-Ago 2026'!BG55+'Set-Dez 2026'!BG55","v":0},{"$nulls":3},0,0,0,null,0,0,0,0,0,{"$f":"'Jan-Abr 2025'!BV55","v":0},{"$f":"'Jan-Abr 2025'!BU55+'Mai-Ago 2025'!BU55+'Set-Dez 2025'!BU55+'Jan-Abr 2026'!BU55+'Mai-Ago 2026'!BU55+'Set-Dez 2026'!BU55","v":0}]
["Sociocultural",5146,"IGO","Introdução à Gestão das Organizações",{"$nulls":5},"B153",25,{"$nulls":7},6418,"OEM","Órgãos e Elementos de Máquinas",{"$nulls":5},"C591",50,{"$nulls":8},0,0,0,null,0,0,0,0,0,{"$f":"'Jan-Abr 2025'!AT56","v":0},{"$f":"'Jan-Abr 2025'!AS56+'Mai-Ago 2025'!AS56+'Set-Dez 2025'!AS56+'Jan-Abr 2026'!AS56+'Mai-Ago 2026'!AS56+'Set-Dez 2026'!AS56","v":0},{"$nulls":3},0,0,0,null,0,0,0,0,0,{"$f":"'Jan-Abr 2025'!BH56","v":0},{"$f":"'Jan-Abr 2025'!BG56+'Mai-Ago 2025'!BG56+'Set-Dez 2025'!BG56+'Jan-Abr 2026'!BG56+'Mai-Ago 2026'!BG56+'Set-Dez 2026'!BG56","v":0},{"$nulls":3},0,0,0,null,0,0,0,0,0,{"$f":"'Jan-Abr 2025'!BV56","v":0},{"$f":"'Jan-Abr 2025'!BU56+'Mai-Ago 2025'!BU56+'Set-Dez 2025'!BU56+'Jan-Abr 2026'!BU56+'Mai-Ago 2026'!BU56+'Set-Dez 2026'!BU56","v":0}]
[null,5152,"GMQ","Gestão e Motivação para a Qualidade",{"$nulls":5},"B155",25,{"$nulls":7},"6442","GP","Gestão de Projetos",{"$nulls":6},50,{"$nulls":8},0,0,0,null,0,0,0,0,0,{"$f":"'Jan-Abr 2025'!AT57","v":0},{"$f":"'Jan-Abr 2025'!AS57+'Mai-Ago 2025'!AS57+'Set-Dez 2025'!AS57+'Jan-Abr 2026'!AS57+'Mai-Ago 2026'!AS57+'Set-Dez 2026'!AS57","v":0},{"$nulls":3},0,0,0,null,0,0,0,0,0,{"$f":"'Jan-Abr 2025'!BH57","v":0},{"$f":"'Jan-Abr 2025'!BG57+'Mai-Ago 2025'!BG57+'Set-Dez 2025'!BG57+'Jan-Abr 2026'!BG57+'Mai-Ago 2026'!BG57+'Set-Dez 2026'!BG57","v":0},{"$nulls":3},0,0,0,null,0,0,0,0,0,{"$f":"'Jan-Abr 2025'!BV57","v":0},{"$f":"'Jan-Abr 2025'!BU57+'Mai-Ago 2025'!BU57+'Set-Dez 2025'!BU57+'Jan-Abr 2026'!BU57+'Mai-Ago 2026'!BU57+'Set-Dez 2026'!BU57","v":0}]
[null,5149,"SGQ","Sistama de Gestão da Qualidade ISO 9001",{"$nulls":5},"F369",25,{"$nulls":7},"6443","PP","Planeamento da Produção",{"$nulls":6},50,{"$nulls":8},0,0,0,null,0,0,0,0,0,{"$f":"'Jan-Abr 2025'!AT58","v":0},{"$f":"'Jan-Abr 2025'!AS58+'Mai-Ago 2025'!AS58+'Set-Dez 2025'!AS58+'Jan-Abr 2026'!AS58+'Mai-Ago 2026'!AS58+'Set-Dez 2026'!AS58","v":0},{"$nulls":3},0,0,0,null,0,0,0,0,0,{"$f":"'Jan-Abr 2025'!BH58","v":0},{"$f":"'Jan-Abr 2025'!BG58+'Mai-Ago 2025'!BG58+'Set-Dez 2025'!BG58+'Jan-Abr 2026'!BG58+'Mai-Ago 2026'!BG58+'Set-Dez 2026'!BG58","v":0},{"$nulls":3},0,0,0,null,0,0,0,0,0,{"$f":"'Jan-Abr 2025'!BV58","v":0},{"$f":"'Jan-Abr 2025'!BU58+'Mai-Ago 2025'!BU58+'Set-Dez 2025'!BU58+'Jan-Abr 2026'!BU58+'Mai-Ago 2026'!BU58+'Set-Dez 2026'!BU58","v":0}]
[null,349,"ASHST","Ambiente, Segurança, Higiene e Saúde no Trabalho",{"$nulls":5},"F423",25,{"$nulls":7},"6444","GS","Gestão de Stocks - Metodologias",{"$nulls":6},50,{"$nulls":8},0,0,0,null,0,0,0,0,0,{"$f":"'Jan-Abr 2025'!AT59","v":0},{"$f":"'Jan-Abr 2025'!AS59+'Mai-Ago 2025'!AS59+'Set-Dez 2025'!AS59+'Jan-Abr 2026'!AS59+'Mai-Ago 2026'!AS59+'Set-Dez 2026'!AS59","v":0},{"$nulls":3},0,0,0,null,0,0,0,0,0,{"$f":"'Jan-Abr 2025'!BH59","v":0},{"$f":"'Jan-Abr 2025'!BG59+'Mai-Ago 2025'!BG59+'Set-Dez 2025'!BG59+'Jan-Abr 2026'!BG59+'Mai-Ago 2026'!BG59+'Set-Dez 2026'!BG59","v":0},{"$nulls":3},0,0,0,null,0,0,0,0,0,{"$f":"'Jan-Abr 2025'!BV59","v":0},{"$f":"'Jan-Abr 2025'!BU59+'Mai-Ago 2025'!BU59+'Set-Dez 2025'!BU59+'Jan-Abr 2026'!BU59+'Mai-Ago 2026'!BU59+'Set-Dez 2026'!BU59","v":0}]
[null,5653,"DT","Direito do Trabalho",{"$nulls":5},"B154",25,{"$nulls":7},"1054","CGO","Custeio e Gestão Orçamental",{"$nulls":6},50,{"$nulls":8},0,0,0,null,0,0,0,0,0,{"$f":"'Jan-Abr 2025'!AT60","v":0},{"$f":"'Jan-Abr 2025'!AS60+'Mai-Ago 2025'!AS60+'Set-Dez 2025'!AS60+'Jan-Abr 2026'!AS60+'Mai-Ago 2026'!AS60+'Set-Dez 2026'!AS60","v":0},{"$nulls":3},0,0,0,null,0,0,0,0,0,{"$f":"'Jan-Abr 2025'!BH60","v":0},{"$f":"'Jan-Abr 2025'!BG60+'Mai-Ago 2025'!BG60+'Set-Dez 2025'!BG60+'Jan-Abr 2026'!BG60+'Mai-Ago 2026'!BG60+'Set-Dez 2026'!BG60","v":0},{"$nulls":3},0,0,0,null,0,0,0,0,0,{"$f":"'Jan-Abr 2025'!BV60","v":0},{"$f":"'Jan-Abr 2025'!BU60+'Mai-Ago 2025'!BU60+'Set-Dez 2025'!BU60+'Jan-Abr 2026'!BU60+'Mai-Ago 2026'!BU60+'Set-Dez 2026'!BU60","v":0}]
[null,5768,"ICS","Inglês em Contexto Socioprofissional",{"$nulls":5},"L046",25,{"$nulls":7},"6445","LOG","Logistica ",{"$nulls":6},50,{"$nulls":8},0,0,0,null,0,0,0,0,0,{"$f":"'Jan-Abr 2025'!AT61","v":0},{"$f":"'Jan-Abr 2025'!AS61+'Mai-Ago 2025'!AS61+'Set-Dez 2025'!AS61+'Jan-Abr 2026'!AS61+'Mai-Ago 2026'!AS61+'Set-Dez 2026'!AS61","v":0},{"$nulls":3},0,0,0,null,0,0,0,0,0,{"$f":"'Jan-Abr 2025'!BH61","v":0},{"$f":"'Jan-Abr 2025'!BG61+'Mai-Ago 2025'!BG61+'Set-Dez 2025'!BG61+'Jan-Abr 2026'!BG61+'Mai-Ago 2026'!BG61+'Set-Dez 2026'!BG61","v":0},{"$nulls":3},0,0,0,null,0,0,0,0,0,{"$f":"'Jan-Abr 2025'!BV61","v":0},{"$f":"'Jan-Abr 2025'!BU61+'Mai-Ago 2025'!BU61+'Set-Dez 2025'!BU61+'Jan-Abr 2026'!BU61+'Mai-Ago 2026'!BU61+'Set-Dez 2026'!BU61","v":0}]
[{"$nulls":18},"6446","MOT","Métodos e Organização do Trabalho",{"$nulls":6},50,{"$nulls":8},0,0,0,null,0,0,0,0,0,{"$f":"'Jan-Abr 2025'!AT62","v":0},{"$f":"'Jan-Abr 2025'!AS62+'Mai-Ago 2025'!AS62+'Set-Dez 2025'!AS62+'Jan-Abr 2026'!AS62+'Mai-Ago 2026'!AS62+'Set-Dez 2026'!AS62","v":0},{"$nulls":3},0,0,0,null,0,0,0,0,0,{"$f":"'Jan-Abr 2025'!BH62","v":0},{"$f":"'Jan-Abr 2025'!BG62+'Mai-Ago 2025'!BG62+'Set-Dez 2025'!BG62+'Jan-Abr 2026'!BG62+'Mai-Ago 2026'!BG62+'Set-Dez 2026'!BG62","v":0},{"$nulls":3},0,0,0,null,0,0,0,0,0,{"$f":"'Jan-Abr 2025'!BV62","v":0},{"$f":"'Jan-Abr 2025'!BU62+'Mai-Ago 2025'!BU62+'Set-Dez 2025'!BU62+'Jan-Abr 2026'!BU62+'Mai-Ago 2026'!BU62+'Set-Dez 2026'!BU62","v":0}]
[{"$nulls":18},"6447","SGI","Sistema de Gestão Integrada",{"$nulls":6},25,{"$nulls":8},0,0,0,null,0,0,0,0,0,{"$f":"'Jan-Abr 2025'!AT63","v":0},{"$f":"'Jan-Abr 2025'!AS63+'Mai-Ago 2025'!AS63+'Set-Dez 2025'!AS63+'Jan-Abr 2026'!AS63+'Mai-Ago 2026'!AS63+'Set-Dez 2026'!AS63","v":0},{"$nulls":3},0,0,0,null,{"$f":"COUNTIF($C$10:$AG$18,$AX63)","v":0},{"$f":"COUNTIF($C$22:$AG$30,$AX63)","v":0},{"$f":"COUNTIF($C$34:$AG$42,$AX63)","v":0},{"$f":"COUNTIF($C$46:$AG$54,$AX63)","v":0},0,{"$f":"'Jan-Abr 2025'!BH63","v":0},{"$f":"'Jan-Abr 2025'!BG63+'Mai-Ago 2025'!BG63+'Set-Dez 2025'!BG63+'Jan-Abr 2026'!BG63+'Mai-Ago 2026'!BG63+'Set-Dez 2026'!BG63","v":0},{"$nulls":3},0,0,0,null,0,0,0,0,0,{"$f":"'Jan-Abr 2025'!BV63","v":0},{"$f":"'Jan-Abr 2025'!BU63+'Mai-Ago 2025'!BU63+'Set-Dez 2025'!BU63+'Jan-Abr 2026'!BU63+'Mai-Ago 2026'!BU63+'Set-Dez 2026'!BU63","v":0}]
["Tecnológica",6407,"PFL","Processos de Fundição / Ligação",{"$nulls":5},"D333",25,{"$nulls":7},"6448","QCEP","Qualidade - controlo estatístico de processo",{"$nulls":6},50,{"$nulls":8},0,0,0,null,0,0,0,0,0,{"$f":"'Jan-Abr 2025'!AT64","v":0},{"$f":"'Jan-Abr 2025'!AS64+'Mai-Ago 2025'!AS64+'Set-Dez 2025'!AS64+'Jan-Abr 2026'!AS64+'Mai-Ago 2026'!AS64+'Set-Dez 2026'!AS64","v":0},{"$nulls":3},0,0,0,null,0,0,0,0,0,{"$f":"'Jan-Abr 2025'!BH64","v":0},{"$f":"'Jan-Abr 2025'!BG64+'Mai-Ago 2025'!BG64+'Set-Dez 2025'!BG64+'Jan-Abr 2026'!BG64+'Mai-Ago 2026'!BG64+'Set-Dez 2026'!BG64","v":0},{"$nulls":3},0,0,0,null,0,0,0,0,0,{"$f":"'Jan-Abr 2025'!BV64","v":0},{"$f":"'Jan-Abr 2025'!BU64+'Mai-Ago 2025'!BU64+'Set-Dez 2025'!BU64+'Jan-Abr 2026'!BU64+'Mai-Ago 2026'!BU64+'Set-Dez 2026'!BU64","v":0}]
[null,6408,"PCC","Processos de Conformação / Corte",{"$nulls":5},"D334",25,{"$nulls":25},0,0,0,null,0,0,0,0,0,{"$f":"'Jan-Abr 2025'!AT65","v":0},{"$f":"'Jan-Abr 2025'!AS65+'Mai-Ago 2025'!AS65+'Set-Dez 2025'!AS65+'Jan-Abr 2026'!AS65+'Mai-Ago 2026'!AS65+'Set-Dez 2026'!AS65","v":0},{"$nulls":3},0,0,0,null,0,0,0,0,0,{"$f":"'Jan-Abr 2025'!BH65","v":0},{"$f":"'Jan-Abr 2025'!BG65+'Mai-Ago 2025'!BG65+'Set-Dez 2025'!BG65+'Jan-Abr 2026'!BG65+'Mai-Ago 2026'!BG65+'Set-Dez 2026'!BG65","v":0},{"$nulls":3},0,0,0,null,0,0,0,{"$f":"COUNTIF($C$46:$AG$54,$BL65)","v":0},0,{"$f":"'Jan-Abr 2025'!BV65","v":0},{"$f":"'Jan-Abr 2025'!BU65+'Mai-Ago 2025'!BU65+'Set-Dez 2025'!BU65+'Jan-Abr 2026'!BU65+'Mai-Ago 2026'!BU65+'Set-Dez 2026'!BU65","v":0}]
[null,6409,"PAA","Processos por Arranque de Apara",{"$nulls":5},"C588",25,{"$nulls":25},0,0,0,null,0,0,0,0,0,{"$f":"'Jan-Abr 2025'!AT66","v":0},{"$f":"'Jan-Abr 2025'!AS66+'Mai-Ago 2025'!AS66+'Set-Dez 2025'!AS66+'Jan-Abr 2026'!AS66+'Mai-Ago 2026'!AS66+'Set-Dez 2026'!AS66","v":0},{"$nulls":3},0,0,0,null,0,0,0,0,0,{"$f":"'Jan-Abr 2025'!BH66","v":0},{"$f":"'Jan-Abr 2025'!BG66+'Mai-Ago 2025'!BG66+'Set-Dez 2025'!BG66+'Jan-Abr 2026'!BG66+'Mai-Ago 2026'!BG66+'Set-Dez 2026'!BG66","v":0},{"$nulls":3},0,0,0,null,0,0,0,0,0,{"$f":"'Jan-Abr 2025'!BV66","v":0},{"$f":"'Jan-Abr 2025'!BU66+'Mai-Ago 2025'!BU66+'Set-Dez 2025'!BU66+'Jan-Abr 2026'!BU66+'Mai-Ago 2026'!BU66+'Set-Dez 2026'!BU66","v":0}]
[null,6410,"IME","Instalação de Máquinas Elétricas",{"$nulls":5},"K252",50,{"$nulls":25},0,0,0,null,0,0,0,0,0,{"$f":"'Jan-Abr 2025'!AT67","v":0},{"$f":"'Jan-Abr 2025'!AS67+'Mai-Ago 2025'!AS67+'Set-Dez 2025'!AS67+'Jan-Abr 2026'!AS67+'Mai-Ago 2026'!AS67+'Set-Dez 2026'!AS67","v":0},{"$nulls":3},0,0,0,null,0,0,0,0,0,{"$f":"'Jan-Abr 2025'!BH67","v":0},{"$f":"'Jan-Abr 2025'!BG67+'Mai-Ago 2025'!BG67+'Set-Dez 2025'!BG67+'Jan-Abr 2026'!BG67+'Mai-Ago 2026'!BG67+'Set-Dez 2026'!BG67","v":0},{"$nulls":3},0,0,0,null,0,0,0,0,0,{"$f":"'Jan-Abr 2025'!BV67","v":0},{"$f":"'Jan-Abr 2025'!BU67+'Mai-Ago 2025'!BU67+'Set-Dez 2025'!BU67+'Jan-Abr 2026'!BU67+'Mai-Ago 2026'!BU67+'Set-Dez 2026'!BU67","v":0}]
[null,6411,"ELE","Eletrónica",{"$nulls":5},"K253",50,{"$nulls":25},0,0,0,null,0,0,0,0,0,{"$f":"'Jan-Abr 2025'!AT68","v":0},{"$f":"'Jan-Abr 2025'!AS68+'Mai-Ago 2025'!AS68+'Set-Dez 2025'!AS68+'Jan-Abr 2026'!AS68+'Mai-Ago 2026'!AS68+'Set-Dez 2026'!AS68","v":0},{"$nulls":3},0,0,0,null,0,0,0,0,0,{"$f":"'Jan-Abr 2025'!BH68","v":0},{"$f":"'Jan-Abr 2025'!BG68+'Mai-Ago 2025'!BG68+'Set-Dez 2025'!BG68+'Jan-Abr 2026'!BG68+'Mai-Ago 2026'!BG68+'Set-Dez 2026'!BG68","v":0},{"$nulls":3},0,0,0,null,0,0,0,0,0,{"$f":"'Jan-Abr 2025'!BV68","v":0},{"$f":"'Jan-Abr 2025'!BU68+'Mai-Ago 2025'!BU68+'Set-Dez 2025'!BU68+'Jan-Abr 2026'!BU68+'Mai-Ago 2026'!BU68+'Set-Dez 2026'!BU68","v":0}]
[null,6412,"CP","Circuitos Pneumáticos",{"$nulls":5},"E329",25,{"$nulls":25},0,0,0,null,0,0,0,0,0,{"$f":"'Jan-Abr 2025'!AT69","v":0},{"$f":"'Jan-Abr 2025'!AS69+'Mai-Ago 2025'!AS69+'Set-Dez 2025'!AS69+'Jan-Abr 2026'!AS69+'Mai-Ago 2026'!AS69+'Set-Dez 2026'!AS69","v":0},{"$nulls":3},0,0,0,null,0,0,0,0,0,{"$f":"'Jan-Abr 2025'!BH69","v":0},{"$f":"'Jan-Abr 2025'!BG69+'Mai-Ago 2025'!BG69+'Set-Dez 2025'!BG69+'Jan-Abr 2026'!BG69+'Mai-Ago 2026'!BG69+'Set-Dez 2026'!BG69","v":0},{"$nulls":3},0,0,0,null,0,0,0,0,0,{"$f":"'Jan-Abr 2025'!BV69","v":0},{"$f":"'Jan-Abr 2025'!BU69+'Mai-Ago 2025'!BU69+'Set-Dez 2025'!BU69+'Jan-Abr 2026'!BU69+'Mai-Ago 2026'!BU69+'Set-Dez 2026'!BU69","v":0}]
[null,6413,"CH","Circuitos Óleo-Hidráulicos",{"$nulls":5},"E330",25,{"$nulls":6},"Estágio",null,"PCT","Prática em Contexto Trabalho",{"$nulls":5},"E368",560,{"$nulls":8},0,0,0,null,0,0,0,0,0,{"$f":"'Jan-Abr 2025'!AT70","v":0},{"$f":"'Jan-Abr 2025'!AS70+'Mai-Ago 2025'!AS70+'Set-Dez 2025'!AS70+'Jan-Abr 2026'!AS70+'Mai-Ago 2026'!AS70+'Set-Dez 2026'!AS70","v":0},{"$nulls":3},0,0,0,null,0,0,0,0,0,{"$f":"'Jan-Abr 2025'!BH70","v":0},{"$f":"'Jan-Abr 2025'!BG70+'Mai-Ago 2025'!BG70+'Set-Dez 2025'!BG70+'Jan-Abr 2026'!BG70+'Mai-Ago 2026'!BG70+'Set-Dez 2026'!BG70","v":0},{"$nulls":3},0,0,0,null,0,0,0,0,0,{"$f":"'Jan-Abr 2025'!BV70","v":0},{"$f":"'Jan-Abr 2025'!BU70+'Mai-Ago 2025'!BU70+'Set-Dez 2025'!BU70+'Jan-Abr 2026'!BU70+'Mai-Ago 2026'!BU70+'Set-Dez 2026'!BU70","v":0}]
[null,6414,"CLP","Controladores Lógicos Programáveis",{"$nulls":5},"C589",50,{"$nulls":25},0,0,0,null,0,0,0,0,0,{"$f":"'Jan-Abr 2025'!AT71","v":0},{"$f":"'Jan-Abr 2025'!AS71+'Mai-Ago 2025'!AS71+'Set-Dez 2025'!AS71+'Jan-Abr 2026'!AS71+'Mai-Ago 2026'!AS71+'Set-Dez 2026'!AS71","v":0},{"$nulls":3},0,0,0,null,0,0,0,0,0,{"$f":"'Jan-Abr 2025'!BH71","v":0},{"$f":"'Jan-Abr 2025'!BG71+'Mai-Ago 2025'!BG71+'Set-Dez 2025'!BG71+'Jan-Abr 2026'!BG71+'Mai-Ago 2026'!BG71+'Set-Dez 2026'!BG71","v":0},{"$nulls":3},0,0,0,null,0,0,0,0,0,{"$f":"'Jan-Abr 2025'!BV71","v":0},{"$f":"'Jan-Abr 2025'!BU71+'Mai-Ago 2025'!BU71+'Set-Dez 2025'!BU71+'Jan-Abr 2026'!BU71+'Mai-Ago 2026'!BU71+'Set-Dez 2026'!BU71","v":0}]
[null,6415,"DCM","Desenho de Construções Mecânicas",{"$nulls":5},"A438",50,{"$nulls":25},{"$f":"IF(AI72=$DC$8,AM72,IF(AI72=$DC$9,AM72,IF(AI72=$DC$10,AL72,)))","v":0},0,{"$f":"IF(AI72=$DC$8,AL72,IF(AI72=$DC$9,AM73+AL72,IF(AI72=$DC$10,IF(AI73=$DC$10,AM73+AL72,AL72),)))","v":0},null,0,0,0,0,{"$f":"SUM(AO72:AR72)","v":0},{"$f":"'Jan-Abr 2025'!AT72","v":0},{"$f":"'Jan-Abr 2025'!AS72+'Mai-Ago 2025'!AS72+'Set-Dez 2025'!AS72+'Jan-Abr 2026'!AS72+'Mai-Ago 2026'!AS72+'Set-Dez 2026'!AS72","v":0},{"$nulls":3},{"$f":"IF(AW72=$DC$8,BA72,IF(AW72=$DC$9,BA72,IF(AW72=$DC$10,AZ72,)))","v":0},0,{"$f":"IF(AW72=$DC$8,AZ72,IF(AW72=$DC$9,BA73+AZ72,IF(AW72=$DC$10,IF(AW73=$DC$10,BA73+AZ72,AZ72),)))","v":0},null,0,0,0,0,0,{"$f":"'Jan-Abr 2025'!BH72","v":0},{"$f":"'Jan-Abr 2025'!BG72+'Mai-Ago 2025'!BG72+'Set-Dez 2025'!BG72+'Jan-Abr 2026'!BG72+'Mai-Ago 2026'!BG72+'Set-Dez 2026'!BG72","v":0},{"$nulls":3},{"$f":"IF(BK72=$DC$8,BO72,IF(BK72=$DC$9,BO72,IF(BK72=$DC$10,BN72,)))","v":0},0,{"$f":"IF(BK72=$DC$8,BN72,IF(BK72=$DC$9,BO73+BN72,IF(BK72=$DC$10,IF(BK73=$DC$10,BO73+BN72,BN72),)))","v":0},null,0,0,0,0,{"$f":"SUM(BQ72:BT72)","v":0},{"$f":"'Jan-Abr 2025'!BV72","v":0},{"$f":"'Jan-Abr 2025'!BU72+'Mai-Ago 2025'!BU72+'Set-Dez 2025'!BU72+'Jan-Abr 2026'!BU72+'Mai-Ago 2026'!BU72+'Set-Dez 2026'!BU72","v":0}]
[null,6416,"CM","Ciência dos Materiais",{"$nulls":5},"C590",50,{"$nulls":25},0,{"$f":"IF($AK$4=$DB$8,AS73,IF($AK$4=$DB$9,AT73,IF($AK$4=$DB$10,AU73,IF($AK$4=$DB$11,AO73,IF($AK$4=$DB$12,AP73,IF($AK$4=$DB$13,AQ73,IF($AK$4=$DB$14,AR73,\"\")))))))","v":0},0,null,{"$f":"COUNTIF($C$10:$AG$18,$AJ73)","v":0},{"$f":"COUNTIF($C$22:$AG$30,$AJ73)","v":0},{"$f":"COUNTIF($C$34:$AG$42,$AJ73)","v":0},{"$f":"COUNTIF($C$46:$AG$54,$AJ73)","v":0},0,{"$f":"'Jan-Abr 2025'!AT73","v":0},{"$f":"'Jan-Abr 2025'!AS73+'Mai-Ago 2025'!AS73+'Set-Dez 2025'!AS73+'Jan-Abr 2026'!AS73+'Mai-Ago 2026'!AS73+'Set-Dez 2026'!AS73","v":0},{"$nulls":3},0,{"$f":"IF($AK$4=$DB$8,BG73,IF($AK$4=$DB$9,BH73,IF($AK$4=$DB$10,BI73,IF($AK$4=$DB$11,BC73,IF($AK$4=$DB$12,BD73,IF($AK$4=$DB$13,BE73,IF($AK$4=$DB$14,BF73,\"\")))))))","v":0},0,null,{"$f":"COUNTIF($C$10:$AG$18,$AX73)","v":0},{"$f":"COUNTIF($C$22:$AG$30,$AX73)","v":0},{"$f":"COUNTIF($C$34:$AG$42,$AX73)","v":0},{"$f":"COUNTIF($C$46:$AG$54,$AX73)","v":0},{"$f":"SUM(BC73:BF73)","v":0},{"$f":"'Jan-Abr 2025'!BH73","v":0},{"$f":"'Jan-Abr 2025'!BG73+'Mai-Ago 2025'!BG73+'Set-Dez 2025'!BG73+'Jan-Abr 2026'!BG73+'Mai-Ago 2026'!BG73+'Set-Dez 2026'!BG73","v":0},{"$nulls":3},0,{"$f":"IF($AK$4=$DB$8,BU73,IF($AK$4=$DB$9,BV73,IF($AK$4=$DB$10,BW73,IF($AK$4=$DB$11,BQ73,IF($AK$4=$DB$12,BR73,IF($AK$4=$DB$13,BS73,IF($AK$4=$DB$14,BT73,\"\")))))))","v":0},0,null,{"$f":"COUNTIF($C$10:$AG$18,$BL73)","v":0},{"$f":"COUNTIF($C$22:$AG$30,$BL73)","v":0},{"$f":"COUNTIF($C$34:$AG$42,$BL73)","v":0},{"$f":"COUNTIF($C$46:$AG$54,$BL73)","v":0},0,{"$f":"'Jan-Abr 2025'!BV73","v":0},{"$f":"'Jan-Abr 2025'!BU73+'Mai-Ago 2025'!BU73+'Set-Dez 2025'!BU73+'Jan-Abr 2026'!BU73+'Mai-Ago 2026'!BU73+'Set-Dez 2026'!BU73","v":0}]
[null,6417,"SD","Sistemas Digitais",{"$nulls":5},"I159",50,{"$nulls":9},"Seg.","Ter.","Qua.","Qui.","Sex."]
[{"$nulls":19},"Salas:",{"$nulls":16},{"$f":"SUMIF(AI8:AI73,\"=M\",AK8:AK73)+SUMIF(AI8:AI73,\"=T\",AK8:AK73)","v":0},null,null,{"$f":"SUMIF(AI8:AI73,\"=M\",AN8:AN73)+SUMIF(AI8:AI73,\"=T\",AN8:AN73)","v":0},{"$nulls":10},{"$f":"SUMIF(AW8:AW73,\"=M\",AY8:AY73)+SUMIF(AW8:AW73,\"=T\",AY8:AY73)","v":0},null,null,{"$f":"SUMIF(AW8:AW73,\"=M\",BB8:BB73)+SUMIF(AW8:AW73,\"=T\",BB8:BB73)","v":0},{"$nulls":10},{"$f":"SUMIF(BK8:BK73,\"=M\",BM8:BM73)+SUMIF(BK8:BK73,\"=T\",BM8:BM73)","v":0},null,null,{"$f":"SUMIF(BK8:BK73,\"=M\",BP8:BP73)+SUMIF(BK8:BK73,\"=T\",BP8:BP73)","v":0}]
[{"$nulls":34},"Totais",null,{"$f":"AK75+AY75+BM75","v":0},null,null,{"$f":"AN75+BB75+BP75","v":0}]
["R. Quantitativas:"]

{"sheet":"Jan-Abr 2027","index":7,"n_rows":77,"n_cols":107,"rows_kept":77,"merged":[[0,25,0,32],[0,34,2,39],[0,40,6,40],[0,41,6,41],[0,42,6,42],[0,43,6,43],[0,44,6,44],[0,45,6,45],[0,46,6,46],[0,48,2,53],[0,54,6,54],[0,55,6,55],[0,56,6,56],[0,57,6,57],[0,58,6,58],[0,59,6,59],[0,60,6,60],[0,62,2,67],[0,68,6,68],[0,69,6,69],[0,70,6,70],[0,71,6,71],[0,72,6,72],[0,73,6,73],[0,74,6,74],[0,105,6,105],[0,106,6,106],[1,25,1,32],[2,25,2,32],[3,25,3,32],[3,34,6,34],[3,35,6,35],[3,36,6,36],[3,37,6,37],[3,38,6,38],[3,39,6,39],[3,48,6,48],[3,49,6,49],[3,50,6,50],[3,51,6,51],[3,52,6,52],[3,53,6,53],[3,62,6,62],[3,63,6,63],[3,64,6,64],[3,65,6,65],[3,66,6,66],[3,67,6,67],[4,0,4,2],[4,3,4,9],[4,10,4,13],[4,14,4,21],[4,22,4,26],[4,27,4,29],[4,30,4,32],[5,0,5,2],[5,3,5,9],[5,10,5,13],[5,14,5,21],[5,22,5,26],[5,27,5,29],[5,30,5,32],[6,0,6,2],[6,3,6,9],[6,10,6,13],[6,14,6,21],[6,22,6,26],[6,27,6,29],[6,30,6,32],[7,0,8,1],[9,0,9,1],[10,0,10,1],[11,0,11,1],[12,0,12,1],[14,0,14,1],[15,0,15,1],[16,0,16,1],[17,0,17,1],[19,0,20,1],[21,0,21,1],[22,0,22,1],[23,0,23,1],[24,0,24,1],[25,0,25,1],[26,0,26,1],[27,0,27,1],[28,0,28,1],[29,0,29,1],[31,0,32,1],[33,0,33,1],[34,0,34,1],[35,0,35,1],[36,0,36,1],[37,0,37,1],[38,0,38,1],[39,0,39,1],[40,0,40,1],[41,0,41,1],[43,0,44,1],[45,0,45,1],[46,0,46,1],[47,0,47,1],[48,0,48,1],[49,0,49,1],[50,0,50,1],[51,0,51,1],[52,0,52,1],[53,0,53,1],[54,2,54,8],[54,11,54,13],[54,17,54,19],[54,20,54,25],[54,28,54,30],[55,0,60,0],[55,3,55,8],[55,11,55,13],[55,17,63,17],[55,20,55,25],[55,28,55,30],[56,3,56,8],[56,11,56,13],[56,20,56,25],[56,28,56,30],[57,3,57,8],[57,11,57,13],[57,20,57,25],[57,28,57,30],[58,3,58,8],[58,11,58,13],[58,20,58,25],[58,28,58,30],[59,3,59,8],[59,11,59,13],[59,20,59,25],[59,28,59,30],[60,3,60,8],[60,11,60,13],[60,20,60,25],[60,28,60,30],[61,20,61,25],[61,28,61,30],[62,20,62,25],[63,0,73,0],[63,3,63,8],[63,11,63,13],[63,20,63,25],[64,3,64,8],[64,11,64,13],[65,3,65,8],[65,11,65,13],[66,3,66,8],[66,11,66,13],[67,3,67,8],[67,11,67,13],[68,3,68,8],[68,11,68,13],[69,3,69,8],[69,11,69,13],[70,3,70,8],[70,11,70,13],[71,3,71,8],[71,11,71,13],[72,3,72,8],[72,11,72,13],[73,3,73,8],[73,11,73,13],[75,34,75,35],[76,2,76,3],[76,4,76,5],[76,6,76,7],[76,8,76,9],[76,10,76,11],[76,12,76,13]]}
[{"$nulls":40},{"$f":"TEXT($A$8,\"mmm\")","v":"jan"},{"$f":"TEXT($A$20,\"mmm\")","v":"fev"},{"$f":"TEXT($A$32,\"mmm\")","v":"mar"},{"$f":"TEXT($A$44,\"mmm\")","v":"abr"},"Total  Folha","Total Global","Total  Acum.",{"$nulls":7},{"$f":"TEXT($A$8,\"mmm\")","v":"jan"},{"$f":"TEXT($A$20,\"mmm\")","v":"fev"},{"$f":"TEXT($A$32,\"mmm\")","v":"mar"},{"$f":"TEXT($A$44,\"mmm\")","v":"abr"},"Total  Folha","Total Global","Total  Acum.",{"$nulls":7},{"$f":"TEXT($A$8,\"mmm\")","v":"jan"},{"$f":"TEXT($A$20,\"mmm\")","v":"fev"},{"$f":"TEXT($A$32,\"mmm\")","v":"mar"},{"$f":"TEXT($A$44,\"mmm\")","v":"abr"},"Total  Folha","Total Global","Total  Acum.",{"$nulls":30},"tipo_soma","tipo_contador"]
[{"$nulls":25},"Director(a):"]
[{"$nulls":25},"(Cristina Botas)"]
[{"$nulls":34},"Tipo","Módulo","ST","Origem","Cálculo","Objetivo",{"$nulls":8},"Tipo","Módulo",{"$f":"AK4","v":"ST"},"Origem","Cálculo","Objetivo",{"$nulls":8},"Tipo","Módulo",{"$f":"AK4","v":"ST"},"Origem","Cálculo","Objetivo"]
["MODALIDADE:",{"$nulls":9},"CODÍGO DA AÇÃO:",{"$nulls":16},"       U.O.:",null,null,"Torres Vedras"]
["PLANEAMENTO:",{"$nulls":9},"SAÍDA PROFISSIONAL: Técnico/a Especialista em Mecatrónica",{"$nulls":16},"DATA INÍCIO:"]
["COORDENADOR:",{"$nulls":9},"DURAÇÃO:",{"$nulls":16},"DATA FIM  (previsto):"]
["2027-01-01",null,{"$f":"IF(C9<>\"\",CHOOSE(WEEKDAY(C9,1),\"Dom.\",\"Seg.\",\"Ter.\",\"Qua.\",\"Qui.\",\"Sex.\",\"Sáb.\"),\"\")","v":"Sex."},{"$f":"IF(D9<>\"\",CHOOSE(WEEKDAY(D9,1),\"Dom.\",\"Seg.\",\"Ter.\",\"Qua.\",\"Qui.\",\"Sex.\",\"Sáb.\"),\"\")","v":"Sáb."},"Dom.","Seg.","Ter.","Qua.","Qui.","Sex.","Sáb.","Dom.","Seg.","Ter.","Qua.","Qui.","Sex.","Sáb.","Dom.","Seg.","Ter.","Qua.","Qui.","Sex.","Sáb.","Dom.","Seg.","Ter.","Qua.","Qui.","Sex.","Sáb.","Dom.",null,null,"IGO",{"$f":"IF(AI8=$DC$8,AM8,IF(AI8=$DC$9,AM8,IF(AI8=$DC$10,AL8,)))","v":0},{"$f":"IF($AK$4=$DB$8,AS8,IF($AK$4=$DB$9,AT8,IF($AK$4=$DB$10,AU8,IF($AK$4=$DB$11,AO8,IF($AK$4=$DB$12,AP8,IF($AK$4=$DB$13,AQ8,IF($AK$4=$DB$14,AR8,\"\")))))))","v":0},{"$f":"IF(AI8=$DC$8,AL8,IF(AI8=$DC$9,AM9+AL8,IF(AI8=$DC$10,IF(AI9=$DC$10,AM9+AL8,AL8),)))","v":0},25,{"$f":"COUNTIF($C$10:$AG$18,$AJ8)","v":0},{"$f":"COUNTIF($C$22:$AG$30,$AJ8)","v":0},{"$f":"COUNTIF($C$34:$AG$42,$AJ8)","v":0},{"$f":"COUNTIF($C$46:$AG$54,$AJ8)","v":0},{"$f":"SUM(AO8:AR8)","v":0},{"$f":"'Jan-Abr 2025'!AT8","v":0},{"$f":"'Jan-Abr 2025'!AS8+'Mai-Ago 2025'!AS8+'Set-Dez 2025'!AS8+'Jan-Abr 2026'!AS8+'Mai-Ago 2026'!AS8+'Set-Dez 2026'!AS8+'Jan-Abr 2027'!AS8","v":0},{"$nulls":3},{"$f":"IF(AW8=$DC$8,BA8,IF(AW8=$DC$9,BA8,IF(AW8=$DC$10,AZ8,)))","v":0},{"$f":"IF($AK$4=$DB$8,BG8,IF($AK$4=$DB$9,BH8,IF($AK$4=$DB$10,BI8,IF($AK$4=$DB$11,BC8,IF($AK$4=$DB$12,BD8,IF($AK$4=$DB$13,BE8,IF($AK$4=$DB$14,BF8,\"\")))))))","v":0},{"$f":"IF(AW8=$DC$8,AZ8,IF(AW8=$DC$9,BA9+AZ8,IF(AW8=$DC$10,IF(AW9=$DC$10,BA9+AZ8,AZ8),)))","v":0},null,{"$f":"COUNTIF($C$10:$AG$18,$AX8)","v":0},{"$f":"COUNTIF($C$22:$AG$30,$AX8)","v":0},{"$f":"COUNTIF($C$34:$AG$42,$AX8)","v":0},{"$f":"COUNTIF($C$46:$AG$54,$AX8)","v":0},{"$f":"SUM(BC8:BF8)","v":0},{"$f":"'Jan-Abr 2025'!BH8","v":0},{"$f":"'Jan-Abr 2025'!BG8+'Mai-Ago 2025'!BG8+'Set-Dez 2025'!BG8+'Jan-Abr 2026'!BG8+'Mai-Ago 2026'!BG8+'Set-Dez 2026'!BG8+'Jan-Abr 2027'!BG8","v":0},{"$nulls":3},{"$f":"IF(BK8=$DC$8,BO8,IF(BK8=$DC$9,BO8,IF(BK8=$DC$10,BN8,)))","v":0},{"$f":"IF($AK$4=$DB$8,BU8,IF($AK$4=$DB$9,BV8,IF($AK$4=$DB$10,BW8,IF($AK$4=$DB$11,BQ8,IF($AK$4=$DB$12,BR8,IF($AK$4=$DB$13,BS8,IF($AK$4=$DB$14,BT8,\"\")))))))","v":0},{"$f":"IF(BK8=$DC$8,BN8,IF(BK8=$DC$9,BO9+BN8,IF(BK8=$DC$10,IF(BK9=$DC$10,BO9+BN8,BN8),)))","v":0},null,{"$f":"COUNTIF($C$10:$AG$18,$BL8)","v":0},{"$f":"COUNTIF($C$22:$AG$30,$BL8)","v":0},{"$f":"COUNTIF($C$34:$AG$42,$BL8)","v":0},{"$f":"COUNTIF($C$46:$AG$54,$BL8)","v":0},{"$f":"SUM(BQ8:BT8)","v":0},{"$f":"'Jan-Abr 2025'!BV8","v":0},{"$f":"'Jan-Abr 2025'!BU8+'Mai-Ago 2025'!BU8+'Set-Dez 2025'!BU8+'Jan-Abr 2026'!BU8+'Mai-Ago 2026'!BU8+'Set-Dez 2026'!BU8+'Jan-Abr 2027'!BU8","v":0},{"$nulls":30},"SF","M"]
[null,null,{"$f":"A8","v":"2027-01-01"},{"$f":"IF(C9=\"\",\"\",IF(DAY(C9)<DAY(EOMONTH(C9,0)),C9+1,\"\"))","v":"2027-01-02"},{"$f":"IF(D9=\"\",\"\",IF(DAY(D9)<DAY(EOMONTH(D9,0)),D9+1,\"\"))","v":"2027-01-03"},"2027-01-04","2027-01-05","2027-01-06","2027-01-07","2027-01-08",{"$f":"IF(J9=\"\",\"\",IF(DAY(J9)<DAY(EOMONTH(J9,0)),J9+1,\"\"))","v":"2027-01-09"},{"$f":"IF(K9=\"\",\"\",IF(DAY(K9)<DAY(EOMONTH(K9,0)),K9+1,\"\"))","v":"2027-01-10"},"2027-01-11","2027-01-12","2027-01-13","2027-01-14","2027-01-15",{"$f":"IF(Q9=\"\",\"\",IF(DAY(Q9)<DAY(EOMONTH(Q9,0)),Q9+1,\"\"))","v":"2027-01-16"},{"$f":"IF(R9=\"\",\"\",IF(DAY(R9)<DAY(EOMONTH(R9,0)),R9+1,\"\"))","v":"2027-01-17"},"2027-01-18","2027-01-19","2027-01-20","2027-01-21","2027-01-22",{"$f":"IF(X9=\"\",\"\",IF(DAY(X9)<DAY(EOMONTH(X9,0)),X9+1,\"\"))","v":"2027-01-23"},{"$f":"IF(Y9=\"\",\"\",IF(DAY(Y9)<DAY(EOMONTH(Y9,0)),Y9+1,\"\"))","v":"2027-01-24"},"2027-01-25","2027-01-26","2027-01-27","2027-01-28","2027-01-29",{"$f":"IF(AE9=\"\",\"\",IF(DAY(AE9)<DAY(EOMONTH(AE9,0)),AE9+1,\"\"))","v":"2027-01-30"},{"$f":"IF(AF9=\"\",\"\",IF(DAY(AF9)<DAY(EOMONTH(AF9,0)),AF9+1,\"\"))","v":"2027-01-31"},null,null,"GMQ",0,{"$f":"IF($AK$4=$DB$8,AS9,IF($AK$4=$DB$9,AT9,IF($AK$4=$DB$10,AU9,IF($AK$4=$DB$11,AO9,IF($AK$4=$DB$12,AP9,IF($AK$4=$DB$13,AQ9,IF($AK$4=$DB$14,AR9,\"\")))))))","v":0},0,25,{"$f":"COUNTIF($C$10:$AG$18,$AJ9)","v":0},{"$f":"COUNTIF($C$22:$AG$30,$AJ9)","v":0},{"$f":"COUNTIF($C$34:$AG$42,$AJ9)","v":0},{"$f":"COUNTIF($C$46:$AG$54,$AJ9)","v":0},0,{"$f":"'Jan-Abr 2025'!AT9","v":0},{"$f":"'Jan-Abr 2025'!AS9+'Mai-Ago 2025'!AS9+'Set-Dez 2025'!AS9+'Jan-Abr 2026'!AS9+'Mai-Ago 2026'!AS9+'Set-Dez 2026'!AS9+'Jan-Abr 2027'!AS9","v":0},{"$nulls":3},0,{"$f":"IF($AK$4=$DB$8,BG9,IF($AK$4=$DB$9,BH9,IF($AK$4=$DB$10,BI9,IF($AK$4=$DB$11,BC9,IF($AK$4=$DB$12,BD9,IF($AK$4=$DB$13,BE9,IF($AK$4=$DB$14,BF9,\"\")))))))","v":0},0,null,{"$f":"COUNTIF($C$10:$AG$18,$AX9)","v":0},{"$f":"COUNTIF($C$22:$AG$30,$AX9)","v":0},{"$f":"COUNTIF($C$34:$AG$42,$AX9)","v":0},{"$f":"COUNTIF($C$46:$AG$54,$AX9)","v":0},{"$f":"SUM(BC9:BF9)","v":0},{"$f":"'Jan-Abr 2025'!BH9","v":0},{"$f":"'Jan-Abr 2025'!BG9+'Mai-Ago 2025'!BG9+'Set-Dez 2025'!BG9+'Jan-Abr 2026'!BG9+'Mai-Ago 2026'!BG9+'Set-Dez 2026'!BG9+'Jan-Abr 2027'!BG9","v":0},{"$nulls":3},0,{"$f":"IF($AK$4=$DB$8,BU9,IF($AK$4=$DB$9,BV9,IF($AK$4=$DB$10,BW9,IF($AK$4=$DB$11,BQ9,IF($AK$4=$DB$12,BR9,IF($AK$4=$DB$13,BS9,IF($AK$4=$DB$14,BT9,\"\")))))))","v":0},0,null,{"$f":"COUNTIF($C$10:$AG$18,$BL9)","v":0},{"$f":"COUNTIF($C$22:$AG$30,$BL9)","v":0},{"$f":"COUNTIF($C$34:$AG$42,$BL9)","v":0},{"$f":"COUNTIF($C$46:$AG$54,$BL9)","v":0},0,{"$f":"'Jan-Abr 2025'!BV9","v":0},{"$f":"'Jan-Abr 2025'!BU9+'Mai-Ago 2025'!BU9+'Set-Dez 2025'!BU9+'Jan-Abr 2026'!BU9+'Mai-Ago 2026'!BU9+'Set-Dez 2026'!BU9+'Jan-Abr 2027'!BU9","v":0},{"$nulls":30},"ST","T"]
["09h00 - 09h50",{"$nulls":34},"SGQ",0,0,0,25,0,0,0,0,0,{"$f":"'Jan-Abr 2025'!AT10","v":0},{"$f":"'Jan-Abr 2025'!AS10+'Mai-Ago 2025'!AS10+'Set-Dez 2025'!AS10+'Jan-Abr 2026'!AS10+'Mai-Ago 2026'!AS10+'Set-Dez 2026'!AS10+'Jan-Abr 2027'!AS10","v":0},{"$nulls":3},0,0,0,null,0,0,0,0,0,{"$f":"'Jan-Abr 2025'!BH10","v":0},{"$f":"'Jan-Abr 2025'!BG10+'Mai-Ago 2025'!BG10+'Set-Dez 2025'!BG10+'Jan-Abr 2026'!BG10+'Mai-Ago 2026'!BG10+'Set-Dez 2026'!BG10+'Jan-Abr 2027'!BG10","v":0},{"$nulls":3},0,0,0,null,0,0,0,0,0,{"$f":"'Jan-Abr 2025'!BV10","v":0},{"$f":"'Jan-Abr 2025'!BU10+'Mai-Ago 2025'!BU10+'Set-Dez 2025'!BU10+'Jan-Abr 2026'!BU10+'Mai-Ago 2026'!BU10+'Set-Dez 2026'!BU10+'Jan-Abr 2027'!BU10","v":0},{"$nulls":30},"SA","P"]
["09h50 - 10h40",null,"Ano",{"$nulls":32},"ASHST",0,0,0,25,0,0,0,0,0,{"$f":"'Jan-Abr 2025'!AT11","v":0},{"$f":"'Jan-Abr 2025'!AS11+'Mai-Ago 2025'!AS11+'Set-Dez 2025'!AS11+'Jan-Abr 2026'!AS11+'Mai-Ago 2026'!AS11+'Set-Dez 2026'!AS11+'Jan-Abr 2027'!AS11","v":0},{"$nulls":3},0,0,0,null,0,0,0,0,0,{"$f":"'Jan-Abr 2025'!BH11","v":0},{"$f":"'Jan-Abr 2025'!BG11+'Mai-Ago 2025'!BG11+'Set-Dez 2025'!BG11+'Jan-Abr 2026'!BG11+'Mai-Ago 2026'!BG11+'Set-Dez 2026'!BG11+'Jan-Abr 2027'!BG11","v":0},{"$nulls":3},0,0,0,null,0,0,0,0,0,{"$f":"'Jan-Abr 2025'!BV11","v":0},{"$f":"'Jan-Abr 2025'!BU11+'Mai-Ago 2025'!BU11+'Set-Dez 2025'!BU11+'Jan-Abr 2026'!BU11+'Mai-Ago 2026'!BU11+'Set-Dez 2026'!BU11+'Jan-Abr 2027'!BU11","v":0},{"$nulls":30},{"$f":"TEXT(A8,\"mmm\")","v":"jan"}]
["11h00 - 11h50",null,"Novo",{"$nulls":32},"DT",0,0,0,25,0,0,0,0,0,{"$f":"'Jan-Abr 2025'!AT12","v":0},{"$f":"'Jan-Abr 2025'!AS12+'Mai-Ago 2025'!AS12+'Set-Dez 2025'!AS12+'Jan-Abr 2026'!AS12+'Mai-Ago 2026'!AS12+'Set-Dez 2026'!AS12+'Jan-Abr 2027'!AS12","v":0},{"$nulls":3},0,0,0,null,0,0,0,0,0,{"$f":"'Jan-Abr 2025'!BH12","v":0},{"$f":"'Jan-Abr 2025'!BG12+'Mai-Ago 2025'!BG12+'Set-Dez 2025'!BG12+'Jan-Abr 2026'!BG12+'Mai-Ago 2026'!BG12+'Set-Dez 2026'!BG12+'Jan-Abr 2027'!BG12","v":0},{"$nulls":3},0,0,0,null,0,0,0,0,0,{"$f":"'Jan-Abr 2025'!BV12","v":0},{"$f":"'Jan-Abr 2025'!BU12+'Mai-Ago 2025'!BU12+'Set-Dez 2025'!BU12+'Jan-Abr 2026'!BU12+'Mai-Ago 2026'!BU12+'Set-Dez 2026'!BU12+'Jan-Abr 2027'!BU12","v":0},{"$nulls":30},{"$f":"TEXT(A20,\"mmm\")","v":"fev"}]
["11h50 - 12h40",{"$nulls":34},"ICS",0,0,0,25,0,0,0,0,0,{"$f":"'Jan-Abr 2025'!AT13","v":0},{"$f":"'Jan-Abr 2025'!AS13+'Mai-Ago 2025'!AS13+'Set-Dez 2025'!AS13+'Jan-Abr 2026'!AS13+'Mai-Ago 2026'!AS13+'Set-Dez 2026'!AS13+'Jan-Abr 2027'!AS13","v":0},{"$nulls":3},0,0,0,null,0,0,0,0,0,{"$f":"'Jan-Abr 2025'!BH13","v":0},{"$f":"'Jan-Abr 2025'!BG13+'Mai-Ago 2025'!BG13+'Set-Dez 2025'!BG13+'Jan-Abr 2026'!BG13+'Mai-Ago 2026'!BG13+'Set-Dez 2026'!BG13+'Jan-Abr 2027'!BG13","v":0},{"$nulls":3},0,0,0,null,0,0,0,0,0,{"$f":"'Jan-Abr 2025'!BV13","v":0},{"$f":"'Jan-Abr 2025'!BU13+'Mai-Ago 2025'!BU13+'Set-Dez 2025'!BU13+'Jan-Abr 2026'!BU13+'Mai-Ago 2026'!BU13+'Set-Dez 2026'!BU13+'Jan-Abr 2027'!BU13","v":0},{"$nulls":30},{"$f":"TEXT(A32,\"mmm\")","v":"mar"}]
[{"$nulls":36},0,0,0,null,0,0,0,0,0,{"$f":"'Jan-Abr 2025'!AT14","v":0},{"$f":"'Jan-Abr 2025'!AS14+'Mai-Ago 2025'!AS14+'Set-Dez 2025'!AS14+'Jan-Abr 2026'!AS14+'Mai-Ago 2026'!AS14+'Set-Dez 2026'!AS14+'Jan-Abr 2027'!AS14","v":0},{"$nulls":3},0,0,0,null,0,0,0,0,0,{"$f":"'Jan-Abr 2025'!BH14","v":0},{"$f":"'Jan-Abr 2025'!BG14+'Mai-Ago 2025'!BG14+'Set-Dez 2025'!BG14+'Jan-Abr 2026'!BG14+'Mai-Ago 2026'!BG14+'Set-Dez 2026'!BG14+'Jan-Abr 2027'!BG14","v":0},{"$nulls":3},0,0,0,null,0,0,0,0,0,{"$f":"'Jan-Abr 2025'!BV14","v":0},{"$f":"'Jan-Abr 2025'!BU14+'Mai-Ago 2025'!BU14+'Set-Dez 2025'!BU14+'Jan-Abr 2026'!BU14+'Mai-Ago 2026'!BU14+'Set-Dez 2026'!BU14+'Jan-Abr 2027'!BU14","v":0},{"$nulls":30},{"$f":"TEXT(A44,\"mmm\")","v":"abr"}]
["14h00 - 14h50",{"$nulls":34},"PFL",0,0,0,25,0,0,0,0,0,{"$f":"'Jan-Abr 2025'!AT15","v":0},{"$f":"'Jan-Abr 2025'!AS15+'Mai-Ago 2025'!AS15+'Set-Dez 2025'!AS15+'Jan-Abr 2026'!AS15+'Mai-Ago 2026'!AS15+'Set-Dez 2026'!AS15+'Jan-Abr 2027'!AS15","v":0},{"$nulls":3},0,0,0,null,0,0,0,0,0,{"$f":"'Jan-Abr 2025'!BH15","v":0},{"$f":"'Jan-Abr 2025'!BG15+'Mai-Ago 2025'!BG15+'Set-Dez 2025'!BG15+'Jan-Abr 2026'!BG15+'Mai-Ago 2026'!BG15+'Set-Dez 2026'!BG15+'Jan-Abr 2027'!BG15","v":0},{"$nulls":3},0,0,0,null,0,0,0,0,0,{"$f":"'Jan-Abr 2025'!BV15","v":0},{"$f":"'Jan-Abr 2025'!BU15+'Mai-Ago 2025'!BU15+'Set-Dez 2025'!BU15+'Jan-Abr 2026'!BU15+'Mai-Ago 2026'!BU15+'Set-Dez 2026'!BU15+'Jan-Abr 2027'!BU15","v":0}]
["14h50 - 15h40",{"$nulls":34},"PCC",0,0,0,25,0,0,0,0,0,{"$f":"'Jan-Abr 2025'!AT16","v":0},{"$f":"'Jan-Abr 2025'!AS16+'Mai-Ago 2025'!AS16+'Set-Dez 2025'!AS16+'Jan-Abr 2026'!AS16+'Mai-Ago 2026'!AS16+'Set-Dez 2026'!AS16+'Jan-Abr 2027'!AS16","v":0},{"$nulls":3},0,0,0,null,0,0,0,0,0,{"$f":"'Jan-Abr 2025'!BH16","v":0},{"$f":"'Jan-Abr 2025'!BG16+'Mai-Ago 2025'!BG16+'Set-Dez 2025'!BG16+'Jan-Abr 2026'!BG16+'Mai-Ago 2026'!BG16+'Set-Dez 2026'!BG16+'Jan-Abr 2027'!BG16","v":0},{"$nulls":3},0,0,0,null,0,0,0,0,0,{"$f":"'Jan-Abr 2025'!BV16","v":0},{"$f":"'Jan-Abr 2025'!BU16+'Mai-Ago 2025'!BU16+'Set-Dez 2025'!BU16+'Jan-Abr 2026'!BU16+'Mai-Ago 2026'!BU16+'Set-Dez 2026'!BU16+'Jan-Abr 2027'!BU16","v":0}]
["16h00 - 16h50",{"$nulls":34},"PAA",0,0,0,25,0,0,0,0,0,{"$f":"'Jan-Abr 2025'!AT17","v":0},{"$f":"'Jan-Abr 2025'!AS17+'Mai-Ago 2025'!AS17+'Set-Dez 2025'!AS17+'Jan-Abr 2026'!AS17+'Mai-Ago 2026'!AS17+'Set-Dez 2026'!AS17+'Jan-Abr 2027'!AS17","v":0},{"$nulls":3},0,0,0,null,0,0,0,0,0,{"$f":"'Jan-Abr 2025'!BH17","v":0},{"$f":"'Jan-Abr 2025'!BG17+'Mai-Ago 2025'!BG17+'Set-Dez 2025'!BG17+'Jan-Abr 2026'!BG17+'Mai-Ago 2026'!BG17+'Set-Dez 2026'!BG17+'Jan-Abr 2027'!BG17","v":0},{"$nulls":3},0,0,0,null,0,0,0,0,0,{"$f":"'Jan-Abr 2025'!BV17","v":0},{"$f":"'Jan-Abr 2025'!BU17+'Mai-Ago 2025'!BU17+'Set-Dez 2025'!BU17+'Jan-Abr 2026'!BU17+'Mai-Ago 2026'!BU17+'Set-Dez 2026'!BU17+'Jan-Abr 2027'!BU17","v":0}]
["16h50 - 17h40",{"$nulls":34},"IME",0,0,0,50,0,0,0,0,0,{"$f":"'Jan-Abr 2025'!AT18","v":0},{"$f":"'Jan-Abr 2025'!AS18+'Mai-Ago 2025'!AS18+'Set-Dez 2025'!AS18+'Jan-Abr 2026'!AS18+'Mai-Ago 2026'!AS18+'Set-Dez 2026'!AS18+'Jan-Abr 2027'!AS18","v":0},{"$nulls":3},0,0,0,null,0,0,0,0,0,{"$f":"'Jan-Abr 2025'!BH18","v":0},{"$f":"'Jan-Abr 2025'!BG18+'Mai-Ago 2025'!BG18+'Set-Dez 2025'!BG18+'Jan-Abr 2026'!BG18+'Mai-Ago 2026'!BG18+'Set-Dez 2026'!BG18+'Jan-Abr 2027'!BG18","v":0},{"$nulls":3},0,0,0,null,0,0,0,0,0,{"$f":"'Jan-Abr 2025'!BV18","v":0},{"$f":"'Jan-Abr 2025'!BU18+'Mai-Ago 2025'!BU18+'Set-Dez 2025'!BU18+'Jan-Abr 2026'!BU18+'Mai-Ago 2026'!BU18+'Set-Dez 2026'!BU18+'Jan-Abr 2027'!BU18","v":0}]
[{"$nulls":35},"ELE",0,0,0,50,0,0,0,0,0,{"$f":"'Jan-Abr 2025'!AT19","v":0},{"$f":"'Jan-Abr 2025'!AS19+'Mai-Ago 2025'!AS19+'Set-Dez 2025'!AS19+'Jan-Abr 2026'!AS19+'Mai-Ago 2026'!AS19+'Set-Dez 2026'!AS19+'Jan-Abr 2027'!AS19","v":0},{"$nulls":3},0,0,0,null,0,0,0,0,0,{"$f":"'Jan-Abr 2025'!BH19","v":0},{"$f":"'Jan-Abr 2025'!BG19+'Mai-Ago 2025'!BG19+'Set-Dez 2025'!BG19+'Jan-Abr 2026'!BG19+'Mai-Ago 2026'!BG19+'Set-Dez 2026'!BG19+'Jan-Abr 2027'!BG19","v":0},{"$nulls":3},0,0,0,null,0,0,0,0,0,{"$f":"'Jan-Abr 2025'!BV19","v":0},{"$f":"'Jan-Abr 2025'!BU19+'Mai-Ago 2025'!BU19+'Set-Dez 2025'!BU19+'Jan-Abr 2026'!BU19+'Mai-Ago 2026'!BU19+'Set-Dez 2026'!BU19+'Jan-Abr 2027'!BU19","v":0}]
[{"$f":"A8+DAY(EOMONTH(A8,0))","v":"2027-02-01"},null,{"$f":"IF(C21<>\"\",CHOOSE(WEEKDAY(C21,1),\"Dom.\",\"Seg.\",\"Ter.\",\"Qua.\",\"Qui.\",\"Sex.\",\"Sáb.\"),\"\")","v":"Seg."},{"$f":"IF(D21<>\"\",CHOOSE(WEEKDAY(D21,1),\"Dom.\",\"Seg.\",\"Ter.\",\"Qua.\",\"Qui.\",\"Sex.\",\"Sáb.\"),\"\")","v":"Ter."},"Qua.","Qui.","Sex.","Sáb.","Dom.","Seg.","Ter.","Qua.","Qui.","Sex.","Sáb.","Dom.","Seg.","Ter.","Qua.","Qui.","Sex.","Sáb.","Dom.","Seg.","Ter.","Qua.","Qui.","Sex.","Sáb.","Dom.","","","",null,null,"CP",0,0,0,25,0,0,0,0,0,{"$f":"'Jan-Abr 2025'!AT20","v":0},{"$f":"'Jan-Abr 2025'!AS20+'Mai-Ago 2025'!AS20+'Set-Dez 2025'!AS20+'Jan-Abr 2026'!AS20+'Mai-Ago 2026'!AS20+'Set-Dez 2026'!AS20+'Jan-Abr 2027'!AS20","v":0},{"$nulls":3},0,0,0,null,0,0,0,0,0,{"$f":"'Jan-Abr 2025'!BH20","v":0},{"$f":"'Jan-Abr 2025'!BG20+'Mai-Ago 2025'!BG20+'Set-Dez 2025'!BG20+'Jan-Abr 2026'!BG20+'Mai-Ago 2026'!BG20+'Set-Dez 2026'!BG20+'Jan-Abr 2027'!BG20","v":0},{"$nulls":3},0,0,0,null,0,0,0,0,0,{"$f":"'Jan-Abr 2025'!BV20","v":0},{"$f":"'Jan-Abr 2025'!BU20+'Mai-Ago 2025'!BU20+'Set-Dez 2025'!BU20+'Jan-Abr 2026'!BU20+'Mai-Ago 2026'!BU20+'Set-Dez 2026'!BU20+'Jan-Abr 2027'!BU20","v":0}]
[null,null,{"$f":"A20","v":"2027-02-01"},{"$f":"IF(C21=\"\",\"\",IF(DAY(C21)<DAY(EOMONTH(C21,0)),C21+1,\"\"))","v":"2027-02-02"},"2027-02-03","2027-02-04","2027-02-05","2027-02-06","2027-02-07","2027-02-08","2027-02-09","2027-02-10","2027-02-11","2027-02-12","2027-02-13","2027-02-14","2027-02-15","2027-02-16","2027-02-17","2027-02-18","2027-02-19","2027-02-20","2027-02-21","2027-02-22","2027-02-23","2027-02-24","2027-02-25","2027-02-26","2027-02-27","2027-02-28","","","",null,null,"CH",0,0,0,25,0,0,0,0,0,{"$f":"'Jan-Abr 2025'!AT21","v":0},{"$f":"'Jan-Abr 2025'!AS21+'Mai-Ago 2025'!AS21+'Set-Dez 2025'!AS21+'Jan-Abr 2026'!AS21+'Mai-Ago 2026'!AS21+'Set-Dez 2026'!AS21+'Jan-Abr 2027'!AS21","v":0},{"$nulls":3},0,0,0,null,0,0,0,0,0,{"$f":"'Jan-Abr 2025'!BH21","v":0},{"$f":"'Jan-Abr 2025'!BG21+'Mai-Ago 2025'!BG21+'Set-Dez 2025'!BG21+'Jan-Abr 2026'!BG21+'Mai-Ago 2026'!BG21+'Set-Dez 2026'!BG21+'Jan-Abr 2027'!BG21","v":0},{"$nulls":3},0,0,0,null,0,0,0,0,0,{"$f":"'Jan-Abr 2025'!BV21","v":0},{"$f":"'Jan-Abr 2025'!BU21+'Mai-Ago 2025'!BU21+'Set-Dez 2025'!BU21+'Jan-Abr 2026'!BU21+'Mai-Ago 2026'!BU21+'Set-Dez 2026'!BU21+'Jan-Abr 2027'!BU21","v":0}]
[{"$f":"A10","v":"09h00 - 09h50"},{"$nulls":34},"CLP",0,0,0,50,0,0,0,0,0,{"$f":"'Jan-Abr 2025'!AT22","v":0},{"$f":"'Jan-Abr 2025'!AS22+'Mai-Ago 2025'!AS22+'Set-Dez 2025'!AS22+'Jan-Abr 2026'!AS22+'Mai-Ago 2026'!AS22+'Set-Dez 2026'!AS22+'Jan-Abr 2027'!AS22","v":0},{"$nulls":3},0,0,0,null,0,0,0,0,0,{"$f":"'Jan-Abr 2025'!BH22","v":0},{"$f":"'Jan-Abr 2025'!BG22+'Mai-Ago 2025'!BG22+'Set-Dez 2025'!BG22+'Jan-Abr 2026'!BG22+'Mai-Ago 2026'!BG22+'Set-Dez 2026'!BG22+'Jan-Abr 2027'!BG22","v":0},{"$nulls":3},0,0,0,null,0,0,0,0,0,{"$f":"'Jan-Abr 2025'!BV22","v":0},{"$f":"'Jan-Abr 2025'!BU22+'Mai-Ago 2025'!BU22+'Set-Dez 2025'!BU22+'Jan-Abr 2026'!BU22+'Mai-Ago 2026'!BU22+'Set-Dez 2026'!BU22+'Jan-Abr 2027'!BU22","v":0}]
[{"$f":"A11","v":"09h50 - 10h40"},{"$nulls":9},"Entrudo",{"$nulls":24},"DCM",0,0,0,50,0,0,0,0,0,{"$f":"'Jan-Abr 2025'!AT23","v":0},{"$f":"'Jan-Abr 2025'!AS23+'Mai-Ago 2025'!AS23+'Set-Dez 2025'!AS23+'Jan-Abr 2026'!AS23+'Mai-Ago 2026'!AS23+'Set-Dez 2026'!AS23+'Jan-Abr 2027'!AS23","v":0},{"$nulls":3},0,0,0,null,0,0,0,0,0,{"$f":"'Jan-Abr 2025'!BH23","v":0},{"$f":"'Jan-Abr 2025'!BG23+'Mai-Ago 2025'!BG23+'Set-Dez 2025'!BG23+'Jan-Abr 2026'!BG23+'Mai-Ago 2026'!BG23+'Set-Dez 2026'!BG23+'Jan-Abr 2027'!BG23","v":0},{"$nulls":3},0,0,0,null,0,0,0,0,0,{"$f":"'Jan-Abr 2025'!BV23","v":0},{"$f":"'Jan-Abr 2025'!BU23+'Mai-Ago 2025'!BU23+'Set-Dez 2025'!BU23+'Jan-Abr 2026'!BU23+'Mai-Ago 2026'!BU23+'Set-Dez 2026'!BU23+'Jan-Abr 2027'!BU23","v":0}]
["11h00 - 11h50",{"$nulls":34},"CM",0,0,0,50,0,0,0,0,0,{"$f":"'Jan-Abr 2025'!AT24","v":0},{"$f":"'Jan-Abr 2025'!AS24+'Mai-Ago 2025'!AS24+'Set-Dez 2025'!AS24+'Jan-Abr 2026'!AS24+'Mai-Ago 2026'!AS24+'Set-Dez 2026'!AS24+'Jan-Abr 2027'!AS24","v":0},{"$nulls":3},0,0,0,null,0,0,0,0,0,{"$f":"'Jan-Abr 2025'!BH24","v":0},{"$f":"'Jan-Abr 2025'!BG24+'Mai-Ago 2025'!BG24+'Set-Dez 2025'!BG24+'Jan-Abr 2026'!BG24+'Mai-Ago 2026'!BG24+'Set-Dez 2026'!BG24+'Jan-Abr 2027'!BG24","v":0},{"$nulls":3},0,0,0,null,0,0,0,0,0,{"$f":"'Jan-Abr 2025'!BV24","v":0},{"$f":"'Jan-Abr 2025'!BU24+'Mai-Ago 2025'!BU24+'Set-Dez 2025'!BU24+'Jan-Abr 2026'!BU24+'Mai-Ago 2026'!BU24+'Set-Dez 2026'!BU24+'Jan-Abr 2027'!BU24","v":0}]
["11h50 - 12h40",{"$nulls":34},"SD",0,0,0,50,0,0,0,0,0,{"$f":"'Jan-Abr 2025'!AT25","v":0},{"$f":"'Jan-Abr 2025'!AS25+'Mai-Ago 2025'!AS25+'Set-Dez 2025'!AS25+'Jan-Abr 2026'!AS25+'Mai-Ago 2026'!AS25+'Set-Dez 2026'!AS25+'Jan-Abr 2027'!AS25","v":0},{"$nulls":3},0,0,0,null,0,0,0,0,0,{"$f":"'Jan-Abr 2025'!BH25","v":0},{"$f":"'Jan-Abr 2025'!BG25+'Mai-Ago 2025'!BG25+'Set-Dez 2025'!BG25+'Jan-Abr 2026'!BG25+'Mai-Ago 2026'!BG25+'Set-Dez 2026'!BG25+'Jan-Abr 2027'!BG25","v":0},{"$nulls":3},0,0,0,null,0,0,0,0,0,{"$f":"'Jan-Abr 2025'!BV25","v":0},{"$f":"'Jan-Abr 2025'!BU25+'Mai-Ago 2025'!BU25+'Set-Dez 2025'!BU25+'Jan-Abr 2026'!BU25+'Mai-Ago 2026'!BU25+'Set-Dez 2026'!BU25+'Jan-Abr 2027'!BU25","v":0}]
[{"$nulls":35},"OEM",0,0,0,50,0,0,0,0,0,{"$f":"'Jan-Abr 2025'!AT26","v":0},{"$f":"'Jan-Abr 2025'!AS26+'Mai-Ago 2025'!AS26+'Set-Dez 2025'!AS26+'Jan-Abr 2026'!AS26+'Mai-Ago 2026'!AS26+'Set-Dez 2026'!AS26+'Jan-Abr 2027'!AS26","v":0},{"$nulls":3},0,0,0,null,0,0,0,0,0,{"$f":"'Jan-Abr 2025'!BH26","v":0},{"$f":"'Jan-Abr 2025'!BG26+'Mai-Ago 2025'!BG26+'Set-Dez 2025'!BG26+'Jan-Abr 2026'!BG26+'Mai-Ago 2026'!BG26+'Set-Dez 2026'!BG26+'Jan-Abr 2027'!BG26","v":0},{"$nulls":3},0,0,0,null,0,0,0,0,0,{"$f":"'Jan-Abr 2025'!BV26","v":0},{"$f":"'Jan-Abr 2025'!BU26+'Mai-Ago 2025'!BU26+'Set-Dez 2025'!BU26+'Jan-Abr 2026'!BU26+'Mai-Ago 2026'!BU26+'Set-Dez 2026'!BU26+'Jan-Abr 2027'!BU26","v":0}]
["14h00 - 14h50",{"$nulls":34},"GP",0,0,0,50,0,0,0,0,0,{"$f":"'Jan-Abr 2025'!AT27","v":0},{"$f":"'Jan-Abr 2025'!AS27+'Mai-Ago 2025'!AS27+'Set-Dez 2025'!AS27+'Jan-Abr 2026'!AS27+'Mai-Ago 2026'!AS27+'Set-Dez 2026'!AS27+'Jan-Abr 2027'!AS27","v":0},{"$nulls":3},0,0,0,null,0,0,0,0,0,{"$f":"'Jan-Abr 2025'!BH27","v":0},{"$f":"'Jan-Abr 2025'!BG27+'Mai-Ago 2025'!BG27+'Set-Dez 2025'!BG27+'Jan-Abr 2026'!BG27+'Mai-Ago 2026'!BG27+'Set-Dez 2026'!BG27+'Jan-Abr 2027'!BG27","v":0},{"$nulls":3},0,0,0,null,0,0,0,0,0,{"$f":"'Jan-Abr 2025'!BV27","v":0},{"$f":"'Jan-Abr 2025'!BU27+'Mai-Ago 2025'!BU27+'Set-Dez 2025'!BU27+'Jan-Abr 2026'!BU27+'Mai-Ago 2026'!BU27+'Set-Dez 2026'!BU27+'Jan-Abr 2027'!BU27","v":0}]
["14h50 - 15h40",{"$nulls":34},"PP",0,0,0,50,0,0,0,0,0,{"$f":"'Jan-Abr 2025'!AT28","v":0},{"$f":"'Jan-Abr 2025'!AS28+'Mai-Ago 2025'!AS28+'Set-Dez 2025'!AS28+'Jan-Abr 2026'!AS28+'Mai-Ago 2026'!AS28+'Set-Dez 2026'!AS28+'Jan-Abr 2027'!AS28","v":0},{"$nulls":3},0,0,0,null,0,0,0,0,0,{"$f":"'Jan-Abr 2025'!BH28","v":0},{"$f":"'Jan-Abr 2025'!BG28+'Mai-Ago 2025'!BG28+'Set-Dez 2025'!BG28+'Jan-Abr 2026'!BG28+'Mai-Ago 2026'!BG28+'Set-Dez 2026'!BG28+'Jan-Abr 2027'!BG28","v":0},{"$nulls":3},0,0,0,null,0,0,0,0,0,{"$f":"'Jan-Abr 2025'!BV28","v":0},{"$f":"'Jan-Abr 2025'!BU28+'Mai-Ago 2025'!BU28+'Set-Dez 2025'!BU28+'Jan-Abr 2026'!BU28+'Mai-Ago 2026'!BU28+'Set-Dez 2026'!BU28+'Jan-Abr 2027'!BU28","v":0}]
["16h00 - 16h50",{"$nulls":34},"GS",0,0,0,50,0,0,0,0,0,{"$f":"'Jan-Abr 2025'!AT29","v":0},{"$f":"'Jan-Abr 2025'!AS29+'Mai-Ago 2025'!AS29+'Set-Dez 2025'!AS29+'Jan-Abr 2026'!AS29+'Mai-Ago 2026'!AS29+'Set-Dez 2026'!AS29+'Jan-Abr 2027'!AS29","v":0},{"$nulls":3},0,0,0,null,0,0,0,0,0,{"$f":"'Jan-Abr 2025'!BH29","v":0},{"$f":"'Jan-Abr 2025'!BG29+'Mai-Ago 2025'!BG29+'Set-Dez 2025'!BG29+'Jan-Abr 2026'!BG29+'Mai-Ago 2026'!BG29+'Set-Dez 2026'!BG29+'Jan-Abr 2027'!BG29","v":0},{"$nulls":3},0,0,0,null,0,0,0,0,0,{"$f":"'Jan-Abr 2025'!BV29","v":0},{"$f":"'Jan-Abr 2025'!BU29+'Mai-Ago 2025'!BU29+'Set-Dez 2025'!BU29+'Jan-Abr 2026'!BU29+'Mai-Ago 2026'!BU29+'Set-Dez 2026'!BU29+'Jan-Abr 2027'!BU29","v":0}]
["16h50 - 17h40",{"$nulls":34},"CGO",0,0,0,50,0,0,0,0,0,{"$f":"'Jan-Abr 2025'!AT30","v":0},{"$f":"'Jan-Abr 2025'!AS30+'Mai-Ago 2025'!AS30+'Set-Dez 2025'!AS30+'Jan-Abr 2026'!AS30+'Mai-Ago 2026'!AS30+'Set-Dez 2026'!AS30+'Jan-Abr 2027'!AS30","v":0},{"$nulls":3},0,0,0,null,0,0,0,0,0,{"$f":"'Jan-Abr 2025'!BH30","v":0},{"$f":"'Jan-Abr 2025'!BG30+'Mai-Ago 2025'!BG30+'Set-Dez 2025'!BG30+'Jan-Abr 2026'!BG30+'Mai-Ago 2026'!BG30+'Set-Dez 2026'!BG30+'Jan-Abr 2027'!BG30","v":0},{"$nulls":3},0,0,0,null,0,0,0,0,0,{"$f":"'Jan-Abr 2025'!BV30","v":0},{"$f":"'Jan-Abr 2025'!BU30+'Mai-Ago 2025'!BU30+'Set-Dez 2025'!BU30+'Jan-Abr 2026'!BU30+'Mai-Ago 2026'!BU30+'Set-Dez 2026'!BU30+'Jan-Abr 2027'!BU30","v":0}]
[{"$nulls":35},"LOG",0,0,0,50,0,0,0,0,0,{"$f":"'Jan-Abr 2025'!AT31","v":0},{"$f":"'Jan-Abr 2025'!AS31+'Mai-Ago 2025'!AS31+'Set-Dez 2025'!AS31+'Jan-Abr 2026'!AS31+'Mai-Ago 2026'!AS31+'Set-Dez 2026'!AS31+'Jan-Abr 2027'!AS31","v":0},{"$nulls":3},0,0,0,null,0,0,0,0,0,{"$f":"'Jan-Abr 2025'!BH31","v":0},{"$f":"'Jan-Abr 2025'!BG31+'Mai-Ago 2025'!BG31+'Set-Dez 2025'!BG31+'Jan-Abr 2026'!BG31+'Mai-Ago 2026'!BG31+'Set-Dez 2026'!BG31+'Jan-Abr 2027'!BG31","v":0},{"$nulls":3},0,0,0,null,0,0,0,0,0,{"$f":"'Jan-Abr 2025'!BV31","v":0},{"$f":"'Jan-Abr 2025'!BU31+'Mai-Ago 2025'!BU31+'Set-Dez 2025'!BU31+'Jan-Abr 2026'!BU31+'Mai-Ago 2026'!BU31+'Set-Dez 2026'!BU31+'Jan-Abr 2027'!BU31","v":0}]
[{"$f":"A20+DAY(EOMONTH(A20,0))","v":"2027-03-01"},null,{"$f":"IF(C33<>\"\",CHOOSE(WEEKDAY(C33,1),\"Dom.\",\"Seg.\",\"Ter.\",\"Qua.\",\"Qui.\",\"Sex.\",\"Sáb.\"),\"\")","v":"Seg."},{"$f":"IF(D33<>\"\",CHOOSE(WEEKDAY(D33,1),\"Dom.\",\"Seg.\",\"Ter.\",\"Qua.\",\"Qui.\",\"Sex.\",\"Sáb.\"),\"\")","v":"Ter."},"Qua.","Qui.","Sex.","Sáb.","Dom.","Seg.","Ter.","Qua.","Qui.","Sex.","Sáb.","Dom.","Seg.","Ter.","Qua.","Qui.","Sex.","Sáb.","Dom.","Seg.","Ter.","Qua.","Qui.","Sex.","Sáb.","Dom.","Seg.","Ter.","Qua.",null,null,"MOT",0,0,0,50,0,0,0,0,0,{"$f":"'Jan-Abr 2025'!AT32","v":0},{"$f":"'Jan-Abr 2025'!AS32+'Mai-Ago 2025'!AS32+'Set-Dez 2025'!AS32+'Jan-Abr 2026'!AS32+'Mai-Ago 2026'!AS32+'Set-Dez 2026'!AS32+'Jan-Abr 2027'!AS32","v":0},{"$nulls":3},0,0,0,null,0,0,0,0,0,{"$f":"'Jan-Abr 2025'!BH32","v":0},{"$f":"'Jan-Abr 2025'!BG32+'Mai-Ago 2025'!BG32+'Set-Dez 2025'!BG32+'Jan-Abr 2026'!BG32+'Mai-Ago 2026'!BG32+'Set-Dez 2026'!BG32+'Jan-Abr 2027'!BG32","v":0},{"$nulls":3},0,0,0,null,0,0,0,0,0,{"$f":"'Jan-Abr 2025'!BV32","v":0},{"$f":"'Jan-Abr 2025'!BU32+'Mai-Ago 2025'!BU32+'Set-Dez 2025'!BU32+'Jan-Abr 2026'!BU32+'Mai-Ago 2026'!BU32+'Set-Dez 2026'!BU32+'Jan-Abr 2027'!BU32","v":0}]
[null,null,{"$f":"A32","v":"2027-03-01"},{"$f":"IF(C33=\"\",\"\",IF(DAY(C33)<DAY(EOMONTH(C33,0)),C33+1,\"\"))","v":"2027-03-02"},"2027-03-03","2027-03-04","2027-03-05","2027-03-06","2027-03-07","2027-03-08","2027-03-09","2027-03-10","2027-03-11","2027-03-12","2027-03-13","2027-03-14","2027-03-15","2027-03-16","2027-03-17","2027-03-18","2027-03-19","2027-03-20","2027-03-21","2027-03-22","2027-03-23","2027-03-24","2027-03-25","2027-03-26","2027-03-27","2027-03-28","2027-03-29","2027-03-30","2027-03-31",null,null,"SGI",0,0,0,25,0,0,0,0,0,{"$f":"'Jan-Abr 2025'!AT33","v":0},{"$f":"'Jan-Abr 2025'!AS33+'Mai-Ago 2025'!AS33+'Set-Dez 2025'!AS33+'Jan-Abr 2026'!AS33+'Mai-Ago 2026'!AS33+'Set-Dez 2026'!AS33+'Jan-Abr 2027'!AS33","v":0},{"$nulls":3},0,0,0,null,0,0,0,0,0,{"$f":"'Jan-Abr 2025'!BH33","v":0},{"$f":"'Jan-Abr 2025'!BG33+'Mai-Ago 2025'!BG33+'Set-Dez 2025'!BG33+'Jan-Abr 2026'!BG33+'Mai-Ago 2026'!BG33+'Set-Dez 2026'!BG33+'Jan-Abr 2027'!BG33","v":0},{"$nulls":3},0,0,0,null,0,0,0,0,0,{"$f":"'Jan-Abr 2025'!BV33","v":0},{"$f":"'Jan-Abr 2025'!BU33+'Mai-Ago 2025'!BU33+'Set-Dez 2025'!BU33+'Jan-Abr 2026'!BU33+'Mai-Ago 2026'!BU33+'Set-Dez 2026'!BU33+'Jan-Abr 2027'!BU33","v":0}]
[{"$f":"A22","v":"09h00 - 09h50"},{"$nulls":26},"Sexta",{"$nulls":7},"QCEP",0,0,0,50,0,0,0,0,0,{"$f":"'Jan-Abr 2025'!AT34","v":0},{"$f":"'Jan-Abr 2025'!AS34+'Mai-Ago 2025'!AS34+'Set-Dez 2025'!AS34+'Jan-Abr 2026'!AS34+'Mai-Ago 2026'!AS34+'Set-Dez 2026'!AS34+'Jan-Abr 2027'!AS34","v":0},{"$nulls":3},0,0,0,null,0,0,0,0,0,{"$f":"'Jan-Abr 2025'!BH34","v":0},{"$f":"'Jan-Abr 2025'!BG34+'Mai-Ago 2025'!BG34+'Set-Dez 2025'!BG34+'Jan-Abr 2026'!BG34+'Mai-Ago 2026'!BG34+'Set-Dez 2026'!BG34+'Jan-Abr 2027'!BG34","v":0},{"$nulls":3},0,0,0,null,0,0,0,0,0,{"$f":"'Jan-Abr 2025'!BV34","v":0},{"$f":"'Jan-Abr 2025'!BU34+'Mai-Ago 2025'!BU34+'Set-Dez 2025'!BU34+'Jan-Abr 2026'!BU34+'Mai-Ago 2026'!BU34+'Set-Dez 2026'!BU34+'Jan-Abr 2027'!BU34","v":0}]
[{"$f":"A23","v":"09h50 - 10h40"},{"$nulls":26},"Feira",null,"Pascoa",{"$nulls":6},0,0,0,null,0,0,0,0,0,{"$f":"'Jan-Abr 2025'!AT35","v":0},{"$f":"'Jan-Abr 2025'!AS35+'Mai-Ago 2025'!AS35+'Set-Dez 2025'!AS35+'Jan-Abr 2026'!AS35+'Mai-Ago 2026'!AS35+'Set-Dez 2026'!AS35+'Jan-Abr 2027'!AS35","v":0},{"$nulls":3},0,0,0,null,0,0,0,0,0,{"$f":"'Jan-Abr 2025'!BH35","v":0},{"$f":"'Jan-Abr 2025'!BG35+'Mai-Ago 2025'!BG35+'Set-Dez 2025'!BG35+'Jan-Abr 2026'!BG35+'Mai-Ago 2026'!BG35+'Set-Dez 2026'!BG35+'Jan-Abr 2027'!BG35","v":0},{"$nulls":3},0,0,0,null,0,0,0,0,0,{"$f":"'Jan-Abr 2025'!BV35","v":0},{"$f":"'Jan-Abr 2025'!BU35+'Mai-Ago 2025'!BU35+'Set-Dez 2025'!BU35+'Jan-Abr 2026'!BU35+'Mai-Ago 2026'!BU35+'Set-Dez 2026'!BU35+'Jan-Abr 2027'!BU35","v":0}]
["11h00 - 11h50",{"$nulls":26},"Santa",{"$nulls":8},0,0,0,null,0,0,0,0,0,{"$f":"'Jan-Abr 2025'!AT36","v":0},{"$f":"'Jan-Abr 2025'!AS36+'Mai-Ago 2025'!AS36+'Set-Dez 2025'!AS36+'Jan-Abr 2026'!AS36+'Mai-Ago 2026'!AS36+'Set-Dez 2026'!AS36+'Jan-Abr 2027'!AS36","v":0},{"$nulls":3},0,0,0,null,0,0,0,0,0,{"$f":"'Jan-Abr 2025'!BH36","v":0},{"$f":"'Jan-Abr 2025'!BG36+'Mai-Ago 2025'!BG36+'Set-Dez 2025'!BG36+'Jan-Abr 2026'!BG36+'Mai-Ago 2026'!BG36+'Set-Dez 2026'!BG36+'Jan-Abr 2027'!BG36","v":0},{"$nulls":3},0,0,0,null,0,0,0,0,0,{"$f":"'Jan-Abr 2025'!BV36","v":0},{"$f":"'Jan-Abr 2025'!BU36+'Mai-Ago 2025'!BU36+'Set-Dez 2025'!BU36+'Jan-Abr 2026'!BU36+'Mai-Ago 2026'!BU36+'Set-Dez 2026'!BU36+'Jan-Abr 2027'!BU36","v":0}]
["11h50 - 12h40",{"$nulls":35},0,0,0,null,0,0,0,0,0,{"$f":"'Jan-Abr 2025'!AT37","v":0},{"$f":"'Jan-Abr 2025'!AS37+'Mai-Ago 2025'!AS37+'Set-Dez 2025'!AS37+'Jan-Abr 2026'!AS37+'Mai-Ago 2026'!AS37+'Set-Dez 2026'!AS37+'Jan-Abr 2027'!AS37","v":0},{"$nulls":3},0,0,0,null,0,0,0,0,0,{"$f":"'Jan-Abr 2025'!BH37","v":0},{"$f":"'Jan-Abr 2025'!BG37+'Mai-Ago 2025'!BG37+'Set-Dez 2025'!BG37+'Jan-Abr 2026'!BG37+'Mai-Ago 2026'!BG37+'Set-Dez 2026'!BG37+'Jan-Abr 2027'!BG37","v":0},{"$nulls":3},0,0,0,null,0,0,0,0,0,{"$f":"'Jan-Abr 2025'!BV37","v":0},{"$f":"'Jan-Abr 2025'!BU37+'Mai-Ago 2025'!BU37+'Set-Dez 2025'!BU37+'Jan-Abr 2026'!BU37+'Mai-Ago 2026'!BU37+'Set-Dez 2026'!BU37+'Jan-Abr 2027'!BU37","v":0}]
[{"$nulls":36},0,0,0,null,0,0,0,0,0,{"$f":"'Jan-Abr 2025'!AT38","v":0},{"$f":"'Jan-Abr 2025'!AS38+'Mai-Ago 2025'!AS38+'Set-Dez 2025'!AS38+'Jan-Abr 2026'!AS38+'Mai-Ago 2026'!AS38+'Set-Dez 2026'!AS38+'Jan-Abr 2027'!AS38","v":0},{"$nulls":3},0,0,0,null,0,0,0,0,0,{"$f":"'Jan-Abr 2025'!BH38","v":0},{"$f":"'Jan-Abr 2025'!BG38+'Mai-Ago 2025'!BG38+'Set-Dez 2025'!BG38+'Jan-Abr 2026'!BG38+'Mai-Ago 2026'!BG38+'Set-Dez 2026'!BG38+'Jan-Abr 2027'!BG38","v":0},{"$nulls":3},0,0,0,null,0,0,0,0,0,{"$f":"'Jan-Abr 2025'!BV38","v":0},{"$f":"'Jan-Abr 2025'!BU38+'Mai-Ago 2025'!BU38+'Set-Dez 2025'!BU38+'Jan-Abr 2026'!BU38+'Mai-Ago 2026'!BU38+'Set-Dez 2026'!BU38+'Jan-Abr 2027'!BU38","v":0}]
["14h00 - 14h50",{"$nulls":35},0,0,0,null,0,0,0,0,0,{"$f":"'Jan-Abr 2025'!AT39","v":0},{"$f":"'Jan-Abr 2025'!AS39+'Mai-Ago 2025'!AS39+'Set-Dez 2025'!AS39+'Jan-Abr 2026'!AS39+'Mai-Ago 2026'!AS39+'Set-Dez 2026'!AS39+'Jan-Abr 2027'!AS39","v":0},{"$nulls":3},0,0,0,null,0,0,0,0,0,{"$f":"'Jan-Abr 2025'!BH39","v":0},{"$f":"'Jan-Abr 2025'!BG39+'Mai-Ago 2025'!BG39+'Set-Dez 2025'!BG39+'Jan-Abr 2026'!BG39+'Mai-Ago 2026'!BG39+'Set-Dez 2026'!BG39+'Jan-Abr 2027'!BG39","v":0},{"$nulls":3},0,0,0,null,0,0,0,0,0,{"$f":"'Jan-Abr 2025'!BV39","v":0},{"$f":"'Jan-Abr 2025'!BU39+'Mai-Ago 2025'!BU39+'Set-Dez 2025'!BU39+'Jan-Abr 2026'!BU39+'Mai-Ago 2026'!BU39+'Set-Dez 2026'!BU39+'Jan-Abr 2027'!BU39","v":0}]
["14h50 - 15h40",{"$nulls":35},0,0,0,null,0,0,0,0,{"$f":"SUM(AO40:AR40)","v":0},{"$f":"'Jan-Abr 2025'!AT40","v":0},{"$f":"'Jan-Abr 2025'!AS40+'Mai-Ago 2025'!AS40+'Set-Dez 2025'!AS40+'Jan-Abr 2026'!AS40+'Mai-Ago 2026'!AS40+'Set-Dez 2026'!AS40+'Jan-Abr 2027'!AS40","v":0},{"$nulls":3},0,0,0,null,0,0,0,0,0,{"$f":"'Jan-Abr 2025'!BH40","v":0},{"$f":"'Jan-Abr 2025'!BG40+'Mai-Ago 2025'!BG40+'Set-Dez 2025'!BG40+'Jan-Abr 2026'!BG40+'Mai-Ago 2026'!BG40+'Set-Dez 2026'!BG40+'Jan-Abr 2027'!BG40","v":0},{"$nulls":3},0,0,0,null,0,0,0,0,{"$f":"SUM(BQ40:BT40)","v":0},{"$f":"'Jan-Abr 2025'!BV40","v":0},{"$f":"'Jan-Abr 2025'!BU40+'Mai-Ago 2025'!BU40+'Set-Dez 2025'!BU40+'Jan-Abr 2026'!BU40+'Mai-Ago 2026'!BU40+'Set-Dez 2026'!BU40+'Jan-Abr 2027'!BU40","v":0}]
["16h00 - 16h50",{"$nulls":35},0,0,0,null,0,0,0,0,0,{"$f":"'Jan-Abr 2025'!AT41","v":0},{"$f":"'Jan-Abr 2025'!AS41+'Mai-Ago 2025'!AS41+'Set-Dez 2025'!AS41+'Jan-Abr 2026'!AS41+'Mai-Ago 2026'!AS41+'Set-Dez 2026'!AS41+'Jan-Abr 2027'!AS41","v":0},{"$nulls":3},0,0,0,null,0,0,0,0,0,{"$f":"'Jan-Abr 2025'!BH41","v":0},{"$f":"'Jan-Abr 2025'!BG41+'Mai-Ago 2025'!BG41+'Set-Dez 2025'!BG41+'Jan-Abr 2026'!BG41+'Mai-Ago 2026'!BG41+'Set-Dez 2026'!BG41+'Jan-Abr 2027'!BG41","v":0},{"$nulls":3},0,0,0,null,0,0,0,0,0,{"$f":"'Jan-Abr 2025'!BV41","v":0},{"$f":"'Jan-Abr 2025'!BU41+'Mai-Ago 2025'!BU41+'Set-Dez 2025'!BU41+'Jan-Abr 2026'!BU41+'Mai-Ago 2026'!BU41+'Set-Dez 2026'!BU41+'Jan-Abr 2027'!BU41","v":0}]
["16h50 - 17h40",{"$nulls":35},0,0,0,null,0,0,0,0,0,{"$f":"'Jan-Abr 2025'!AT42","v":0},{"$f":"'Jan-Abr 2025'!AS42+'Mai-Ago 2025'!AS42+'Set-Dez 2025'!AS42+'Jan-Abr 2026'!AS42+'Mai-Ago 2026'!AS42+'Set-Dez 2026'!AS42+'Jan-Abr 2027'!AS42","v":0},{"$nulls":3},0,0,0,null,0,0,0,0,0,{"$f":"'Jan-Abr 2025'!BH42","v":0},{"$f":"'Jan-Abr 2025'!BG42+'Mai-Ago 2025'!BG42+'Set-Dez 2025'!BG42+'Jan-Abr 2026'!BG42+'Mai-Ago 2026'!BG42+'Set-Dez 2026'!BG42+'Jan-Abr 2027'!BG42","v":0},{"$nulls":3},0,0,0,null,0,0,0,0,0,{"$f":"'Jan-Abr 2025'!BV42","v":0},{"$f":"'Jan-Abr 2025'!BU42+'Mai-Ago 2025'!BU42+'Set-Dez 2025'!BU42+'Jan-Abr 2026'!BU42+'Mai-Ago 2026'!BU42+'Set-Dez 2026'!BU42+'Jan-Abr 2027'!BU42","v":0}]
[{"$nulls":36},0,0,0,null,0,0,0,0,0,{"$f":"'Jan-Abr 2025'!AT43","v":0},{"$f":"'Jan-Abr 2025'!AS43+'Mai-Ago 2025'!AS43+'Set-Dez 2025'!AS43+'Jan-Abr 2026'!AS43+'Mai-Ago 2026'!AS43+'Set-Dez 2026'!AS43+'Jan-Abr 2027'!AS43","v":0},{"$nulls":3},0,0,0,null,0,0,0,0,0,{"$f":"'Jan-Abr 2025'!BH43","v":0},{"$f":"'Jan-Abr 2025'!BG43+'Mai-Ago 2025'!BG43+'Set-Dez 2025'!BG43+'Jan-Abr 2026'!BG43+'Mai-Ago 2026'!BG43+'Set-Dez 2026'!BG43+'Jan-Abr 2027'!BG43","v":0},{"$nulls":3},0,0,0,null,0,0,0,0,0,{"$f":"'Jan-Abr 2025'!BV43","v":0},{"$f":"'Jan-Abr 2025'!BU43+'Mai-Ago 2025'!BU43+'Set-Dez 2025'!BU43+'Jan-Abr 2026'!BU43+'Mai-Ago 2026'!BU43+'Set-Dez 2026'!BU43+'Jan-Abr 2027'!BU43","v":0}]
[{"$f":"A32+DAY(EOMONTH(A32,0))","v":"2027-04-01"},null,{"$f":"IF(C45<>\"\",CHOOSE(WEEKDAY(C45,1),\"Dom.\",\"Seg.\",\"Ter.\",\"Qua.\",\"Qui.\",\"Sex.\",\"Sáb.\"),\"\")","v":"Qui."},{"$f":"IF(D45<>\"\",CHOOSE(WEEKDAY(D45,1),\"Dom.\",\"Seg.\",\"Ter.\",\"Qua.\",\"Qui.\",\"Sex.\",\"Sáb.\"),\"\")","v":"Sex."},"Sáb.","Dom.","Seg.","Ter.","Qua.","Qui.","Sex.","Sáb.","Dom.","Seg.","Ter.","Qua.","Qui.","Sex.","Sáb.","Dom.","Seg.","Ter.","Qua.","Qui.","Sex.","Sáb.","Dom.","Seg.","Ter.","Qua.","Qui.","Sex.","",{"$nulls":3},0,0,0,null,0,0,0,0,0,{"$f":"'Jan-Abr 2025'!AT44","v":0},{"$f":"'Jan-Abr 2025'!AS44+'Mai-Ago 2025'!AS44+'Set-Dez 2025'!AS44+'Jan-Abr 2026'!AS44+'Mai-Ago 2026'!AS44+'Set-Dez 2026'!AS44+'Jan-Abr 2027'!AS44","v":0},{"$nulls":3},0,0,0,null,0,0,0,0,0,{"$f":"'Jan-Abr 2025'!BH44","v":0},{"$f":"'Jan-Abr 2025'!BG44+'Mai-Ago 2025'!BG44+'Set-Dez 2025'!BG44+'Jan-Abr 2026'!BG44+'Mai-Ago 2026'!BG44+'Set-Dez 2026'!BG44+'Jan-Abr 2027'!BG44","v":0},{"$nulls":3},0,0,0,null,0,0,0,0,0,{"$f":"'Jan-Abr 2025'!BV44","v":0},{"$f":"'Jan-Abr 2025'!BU44+'Mai-Ago 2025'!BU44+'Set-Dez 2025'!BU44+'Jan-Abr 2026'!BU44+'Mai-Ago 2026'!BU44+'Set-Dez 2026'!BU44+'Jan-Abr 2027'!BU44","v":0}]
[null,null,{"$f":"A44","v":"2027-04-01"},{"$f":"IF(C45=\"\",\"\",IF(DAY(C45)<DAY(EOMONTH(C45,0)),C45+1,\"\"))","v":"2027-04-02"},"2027-04-03","2027-04-04","2027-04-05","2027-04-06","2027-04-07","2027-04-08","2027-04-09","2027-04-10","2027-04-11","2027-04-12","2027-04-13","2027-04-14","2027-04-15","2027-04-16","2027-04-17","2027-04-18","2027-04-19","2027-04-20","2027-04-21","2027-04-22","2027-04-23","2027-04-24","2027-04-25","2027-04-26","2027-04-27","2027-04-28","2027-04-29","2027-04-30","",{"$nulls":3},0,0,0,null,0,0,0,0,0,{"$f":"'Jan-Abr 2025'!AT45","v":0},{"$f":"'Jan-Abr 2025'!AS45+'Mai-Ago 2025'!AS45+'Set-Dez 2025'!AS45+'Jan-Abr 2026'!AS45+'Mai-Ago 2026'!AS45+'Set-Dez 2026'!AS45+'Jan-Abr 2027'!AS45","v":0},{"$nulls":3},0,0,0,null,0,0,0,0,0,{"$f":"'Jan-Abr 2025'!BH45","v":0},{"$f":"'Jan-Abr 2025'!BG45+'Mai-Ago 2025'!BG45+'Set-Dez 2025'!BG45+'Jan-Abr 2026'!BG45+'Mai-Ago 2026'!BG45+'Set-Dez 2026'!BG45+'Jan-Abr 2027'!BG45","v":0},{"$nulls":3},0,0,0,null,0,0,0,0,0,{"$f":"'Jan-Abr 2025'!BV45","v":0},{"$f":"'Jan-Abr 2025'!BU45+'Mai-Ago 2025'!BU45+'Set-Dez 2025'!BU45+'Jan-Abr 2026'!BU45+'Mai-Ago 2026'!BU45+'Set-Dez 2026'!BU45+'Jan-Abr 2027'!BU45","v":0}]
[{"$f":"A10","v":"09h00 - 09h50"},{"$nulls":35},0,0,0,null,0,0,0,0,0,{"$f":"'Jan-Abr 2025'!AT46","v":0},{"$f":"'Jan-Abr 2025'!AS46+'Mai-Ago 2025'!AS46+'Set-Dez 2025'!AS46+'Jan-Abr 2026'!AS46+'Mai-Ago 2026'!AS46+'Set-Dez 2026'!AS46+'Jan-Abr 2027'!AS46","v":0},{"$nulls":3},0,0,0,null,0,0,0,0,0,{"$f":"'Jan-Abr 2025'!BH46","v":0},{"$f":"'Jan-Abr 2025'!BG46+'Mai-Ago 2025'!BG46+'Set-Dez 2025'!BG46+'Jan-Abr 2026'!BG46+'Mai-Ago 2026'!BG46+'Set-Dez 2026'!BG46+'Jan-Abr 2027'!BG46","v":0},{"$nulls":3},0,0,0,null,0,0,0,0,0,{"$f":"'Jan-Abr 2025'!BV46","v":0},{"$f":"'Jan-Abr 2025'!BU46+'Mai-Ago 2025'!BU46+'Set-Dez 2025'!BU46+'Jan-Abr 2026'!BU46+'Mai-Ago 2026'!BU46+'Set-Dez 2026'!BU46+'Jan-Abr 2027'!BU46","v":0}]
[{"$f":"A11","v":"09h50 - 10h40"},{"$nulls":25},"Liberd.",{"$nulls":9},0,0,0,null,0,0,0,0,0,{"$f":"'Jan-Abr 2025'!AT47","v":0},{"$f":"'Jan-Abr 2025'!AS47+'Mai-Ago 2025'!AS47+'Set-Dez 2025'!AS47+'Jan-Abr 2026'!AS47+'Mai-Ago 2026'!AS47+'Set-Dez 2026'!AS47+'Jan-Abr 2027'!AS47","v":0},{"$nulls":3},0,0,0,null,0,0,0,0,0,{"$f":"'Jan-Abr 2025'!BH47","v":0},{"$f":"'Jan-Abr 2025'!BG47+'Mai-Ago 2025'!BG47+'Set-Dez 2025'!BG47+'Jan-Abr 2026'!BG47+'Mai-Ago 2026'!BG47+'Set-Dez 2026'!BG47+'Jan-Abr 2027'!BG47","v":0},{"$nulls":3},0,0,0,null,0,0,0,0,0,{"$f":"'Jan-Abr 2025'!BV47","v":0},{"$f":"'Jan-Abr 2025'!BU47+'Mai-Ago 2025'!BU47+'Set-Dez 2025'!BU47+'Jan-Abr 2026'!BU47+'Mai-Ago 2026'!BU47+'Set-Dez 2026'!BU47+'Jan-Abr 2027'!BU47","v":0}]
["11h00 - 11h50",{"$nulls":35},0,0,0,null,0,0,0,0,0,{"$f":"'Jan-Abr 2025'!AT48","v":0},{"$f":"'Jan-Abr 2025'!AS48+'Mai-Ago 2025'!AS48+'Set-Dez 2025'!AS48+'Jan-Abr 2026'!AS48+'Mai-Ago 2026'!AS48+'Set-Dez 2026'!AS48+'Jan-Abr 2027'!AS48","v":0},{"$nulls":3},0,0,0,null,0,0,0,0,0,{"$f":"'Jan-Abr 2025'!BH48","v":0},{"$f":"'Jan-Abr 2025'!BG48+'Mai-Ago 2025'!BG48+'Set-Dez 2025'!BG48+'Jan-Abr 2026'!BG48+'Mai-Ago 2026'!BG48+'Set-Dez 2026'!BG48+'Jan-Abr 2027'!BG48","v":0},{"$nulls":3},0,0,0,null,0,0,0,0,0,{"$f":"'Jan-Abr 2025'!BV48","v":0},{"$f":"'Jan-Abr 2025'!BU48+'Mai-Ago 2025'!BU48+'Set-Dez 2025'!BU48+'Jan-Abr 2026'!BU48+'Mai-Ago 2026'!BU48+'Set-Dez 2026'!BU48+'Jan-Abr 2027'!BU48","v":0}]
["11h50 - 12h40",{"$nulls":35},0,0,0,null,0,0,0,0,0,{"$f":"'Jan-Abr 2025'!AT49","v":0},{"$f":"'Jan-Abr 2025'!AS49+'Mai-Ago 2025'!AS49+'Set-Dez 2025'!AS49+'Jan-Abr 2026'!AS49+'Mai-Ago 2026'!AS49+'Set-Dez 2026'!AS49+'Jan-Abr 2027'!AS49","v":0},{"$nulls":3},0,0,0,null,0,0,0,0,0,{"$f":"'Jan-Abr 2025'!BH49","v":0},{"$f":"'Jan-Abr 2025'!BG49+'Mai-Ago 2025'!BG49+'Set-Dez 2025'!BG49+'Jan-Abr 2026'!BG49+'Mai-Ago 2026'!BG49+'Set-Dez 2026'!BG49+'Jan-Abr 2027'!BG49","v":0},{"$nulls":3},0,0,0,null,0,0,0,0,0,{"$f":"'Jan-Abr 2025'!BV49","v":0},{"$f":"'Jan-Abr 2025'!BU49+'Mai-Ago 2025'!BU49+'Set-Dez 2025'!BU49+'Jan-Abr 2026'!BU49+'Mai-Ago 2026'!BU49+'Set-Dez 2026'!BU49+'Jan-Abr 2027'!BU49","v":0}]
[{"$nulls":36},0,0,0,null,0,0,0,0,0,{"$f":"'Jan-Abr 2025'!AT50","v":0},{"$f":"'Jan-Abr 2025'!AS50+'Mai-Ago 2025'!AS50+'Set-Dez 2025'!AS50+'Jan-Abr 2026'!AS50+'Mai-Ago 2026'!AS50+'Set-Dez 2026'!AS50+'Jan-Abr 2027'!AS50","v":0},{"$nulls":3},0,0,0,null,0,0,0,0,0,{"$f":"'Jan-Abr 2025'!BH50","v":0},{"$f":"'Jan-Abr 2025'!BG50+'Mai-Ago 2025'!BG50+'Set-Dez 2025'!BG50+'Jan-Abr 2026'!BG50+'Mai-Ago 2026'!BG50+'Set-Dez 2026'!BG50+'Jan-Abr 2027'!BG50","v":0},{"$nulls":3},0,0,0,null,0,0,0,0,0,{"$f":"'Jan-Abr 2025'!BV50","v":0},{"$f":"'Jan-Abr 2025'!BU50+'Mai-Ago 2025'!BU50+'Set-Dez 2025'!BU50+'Jan-Abr 2026'!BU50+'Mai-Ago 2026'!BU50+'Set-Dez 2026'!BU50+'Jan-Abr 2027'!BU50","v":0}]
["14h00 - 14h50",{"$nulls":35},0,0,0,null,0,0,0,0,0,{"$f":"'Jan-Abr 2025'!AT51","v":0},{"$f":"'Jan-Abr 2025'!AS51+'Mai-Ago 2025'!AS51+'Set-Dez 2025'!AS51+'Jan-Abr 2026'!AS51+'Mai-Ago 2026'!AS51+'Set-Dez 2026'!AS51+'Jan-Abr 2027'!AS51","v":0},{"$nulls":3},0,0,0,null,0,0,0,0,0,{"$f":"'Jan-Abr 2025'!BH51","v":0},{"$f":"'Jan-Abr 2025'!BG51+'Mai-Ago 2025'!BG51+'Set-Dez 2025'!BG51+'Jan-Abr 2026'!BG51+'Mai-Ago 2026'!BG51+'Set-Dez 2026'!BG51+'Jan-Abr 2027'!BG51","v":0},{"$nulls":3},0,0,0,null,0,0,0,0,0,{"$f":"'Jan-Abr 2025'!BV51","v":0},{"$f":"'Jan-Abr 2025'!BU51+'Mai-Ago 2025'!BU51+'Set-Dez 2025'!BU51+'Jan-Abr 2026'!BU51+'Mai-Ago 2026'!BU51+'Set-Dez 2026'!BU51+'Jan-Abr 2027'!BU51","v":0}]
["14h50 - 15h40",{"$nulls":35},0,0,0,null,0,0,0,0,0,{"$f":"'Jan-Abr 2025'!AT52","v":0},{"$f":"'Jan-Abr 2025'!AS52+'Mai-Ago 2025'!AS52+'Set-Dez 2025'!AS52+'Jan-Abr 2026'!AS52+'Mai-Ago 2026'!AS52+'Set-Dez 2026'!AS52+'Jan-Abr 2027'!AS52","v":0},{"$nulls":3},0,0,0,null,0,0,0,0,0,{"$f":"'Jan-Abr 2025'!BH52","v":0},{"$f":"'Jan-Abr 2025'!BG52+'Mai-Ago 2025'!BG52+'Set-Dez 2025'!BG52+'Jan-Abr 2026'!BG52+'Mai-Ago 2026'!BG52+'Set-Dez 2026'!BG52+'Jan-Abr 2027'!BG52","v":0},{"$nulls":3},0,0,0,null,0,0,0,0,0,{"$f":"'Jan-Abr 2025'!BV52","v":0},{"$f":"'Jan-Abr 2025'!BU52+'Mai-Ago 2025'!BU52+'Set-Dez 2025'!BU52+'Jan-Abr 2026'!BU52+'Mai-Ago 2026'!BU52+'Set-Dez 2026'!BU52+'Jan-Abr 2027'!BU52","v":0}]
["16h00 - 16h50",{"$nulls":35},0,0,0,null,0,0,0,0,0,{"$f":"'Jan-Abr 2025'!AT53","v":0},{"$f":"'Jan-Abr 2025'!AS53+'Mai-Ago 2025'!AS53+'Set-Dez 2025'!AS53+'Jan-Abr 2026'!AS53+'Mai-Ago 2026'!AS53+'Set-Dez 2026'!AS53+'Jan-Abr 2027'!AS53","v":0},{"$nulls":3},0,0,0,null,0,0,0,0,0,{"$f":"'Jan-Abr 2025'!BH53","v":0},{"$f":"'Jan-Abr 2025'!BG53+'Mai-Ago 2025'!BG53+'Set-Dez 2025'!BG53+'Jan-Abr 2026'!BG53+'Mai-Ago 2026'!BG53+'Set-Dez 2026'!BG53+'Jan-Abr 2027'!BG53","v":0},{"$nulls":3},0,0,0,null,0,0,0,0,0,{"$f":"'Jan-Abr 2025'!BV53","v":0},{"$f":"'Jan-Abr 2025'!BU53+'Mai-Ago 2025'!BU53+'Set-Dez 2025'!BU53+'Jan-Abr 2026'!BU53+'Mai-Ago 2026'!BU53+'Set-Dez 2026'!BU53+'Jan-Abr 2027'!BU53","v":0}]
["16h50 - 17h40",{"$nulls":35},0,0,0,null,0,0,0,0,0,{"$f":"'Jan-Abr 2025'!AT54","v":0},{"$f":"'Jan-Abr 2025'!AS54+'Mai-Ago 2025'!AS54+'Set-Dez 2025'!AS54+'Jan-Abr 2026'!AS54+'Mai-Ago 2026'!AS54+'Set-Dez 2026'!AS54+'Jan-Abr 2027'!AS54","v":0},{"$nulls":3},0,0,0,null,0,0,0,0,0,{"$f":"'Jan-Abr 2025'!BH54","v":0},{"$f":"'Jan-Abr 2025'!BG54+'Mai-Ago 2025'!BG54+'Set-Dez 2025'!BG54+'Jan-Abr 2026'!BG54+'Mai-Ago 2026'!BG54+'Set-Dez 2026'!BG54+'Jan-Abr 2027'!BG54","v":0},{"$nulls":3},0,0,0,null,0,0,0,0,0,{"$f":"'Jan-Abr 2025'!BV54","v":0},{"$f":"'Jan-Abr 2025'!BU54+'Mai-Ago 2025'!BU54+'Set-Dez 2025'!BU54+'Jan-Abr 2026'!BU54+'Mai-Ago 2026'!BU54+'Set-Dez 2026'!BU54+'Jan-Abr 2027'!BU54","v":0}]
[{"$nulls":32},"Fim",null,null,"PCT",0,0,0,560,0,0,0,0,0,{"$f":"'Jan-Abr 2025'!AT55","v":0},{"$f":"'Jan-Abr 2025'!AS55+'Mai-Ago 2025'!AS55+'Set-Dez 2025'!AS55+'Jan-Abr 2026'!AS55+'Mai-Ago 2026'!AS55+'Set-Dez 2026'!AS55+'Jan-Abr 2027'!AS55","v":0},{"$nulls":3},0,0,0,null,0,0,0,0,0,{"$f":"'Jan-Abr 2025'!BH55","v":0},{"$f":"'Jan-Abr 2025'!BG55+'Mai-Ago 2025'!BG55+'Set-Dez 2025'!BG55+'Jan-Abr 2026'!BG55+'Mai-Ago 2026'!BG55+'Set-Dez 2026'!BG55+'Jan-Abr 2027'!BG55","v":0},{"$nulls":3},0,0,0,null,0,0,0,0,0,{"$f":"'Jan-Abr 2025'!BV55","v":0},{"$f":"'Jan-Abr 2025'!BU55+'Mai-Ago 2025'!BU55+'Set-Dez 2025'!BU55+'Jan-Abr 2026'!BU55+'Mai-Ago 2026'!BU55+'Set-Dez 2026'!BU55+'Jan-Abr 2027'!BU55","v":0}]
["Sociocultural",5146,"IGO","Introdução à Gestão das Organizações",{"$nulls":5},"B153",25,{"$nulls":7},6418,"OEM","Órgãos e Elementos de Máquinas",{"$nulls":5},"C591",50,{"$nulls":8},0,0,0,null,0,0,0,0,0,{"$f":"'Jan-Abr 2025'!AT56","v":0},{"$f":"'Jan-Abr 2025'!AS56+'Mai-Ago 2025'!AS56+'Set-Dez 2025'!AS56+'Jan-Abr 2026'!AS56+'Mai-Ago 2026'!AS56+'Set-Dez 2026'!AS56+'Jan-Abr 2027'!AS56","v":0},{"$nulls":3},0,0,0,null,0,0,0,0,0,{"$f":"'Jan-Abr 2025'!BH56","v":0},{"$f":"'Jan-Abr 2025'!BG56+'Mai-Ago 2025'!BG56+'Set-Dez 2025'!BG56+'Jan-Abr 2026'!BG56+'Mai-Ago 2026'!BG56+'Set-Dez 2026'!BG56+'Jan-Abr 2027'!BG56","v":0},{"$nulls":3},0,0,0,null,0,0,0,0,0,{"$f":"'Jan-Abr 2025'!BV56","v":0},{"$f":"'Jan-Abr 2025'!BU56+'Mai-Ago 2025'!BU56+'Set-Dez 2025'!BU56+'Jan-Abr 2026'!BU56+'Mai-Ago 2026'!BU56+'Set-Dez 2026'!BU56+'Jan-Abr 2027'!BU56","v":0}]
[null,5152,"GMQ","Gestão e Motivação para a Qualidade",{"$nulls":5},"B155",25,{"$nulls":7},"6442","GP","Gestão de Projetos",{"$nulls":6},50,{"$nulls":8},0,0,0,null,0,0,0,0,0,{"$f":"'Jan-Abr 2025'!AT57","v":0},{"$f":"'Jan-Abr 2025'!AS57+'Mai-Ago 2025'!AS57+'Set-Dez 2025'!AS57+'Jan-Abr 2026'!AS57+'Mai-Ago 2026'!AS57+'Set-Dez 2026'!AS57+'Jan-Abr 2027'!AS57","v":0},{"$nulls":3},0,0,0,null,0,0,0,0,0,{"$f":"'Jan-Abr 2025'!BH57","v":0},{"$f":"'Jan-Abr 2025'!BG57+'Mai-Ago 2025'!BG57+'Set-Dez 2025'!BG57+'Jan-Abr 2026'!BG57+'Mai-Ago 2026'!BG57+'Set-Dez 2026'!BG57+'Jan-Abr 2027'!BG57","v":0},{"$nulls":3},0,0,0,null,0,0,0,0,0,{"$f":"'Jan-Abr 2025'!BV57","v":0},{"$f":"'Jan-Abr 2025'!BU57+'Mai-Ago 2025'!BU57+'Set-Dez 2025'!BU57+'Jan-Abr 2026'!BU57+'Mai-Ago 2026'!BU57+'Set-Dez 2026'!BU57+'Jan-Abr 2027'!BU57","v":0}]
[null,5149,"SGQ","Sistama de Gestão da Qualidade ISO 9001",{"$nulls":5},"F369",25,{"$nulls":7},"6443","PP","Planeamento da Produção",{"$nulls":6},50,{"$nulls":8},0,0,0,null,0,0,0,0,0,{"$f":"'Jan-Abr 2025'!AT58","v":0},{"$f":"'Jan-Abr 2025'!AS58+'Mai-Ago 2025'!AS58+'Set-Dez 2025'!AS58+'Jan-Abr 2026'!AS58+'Mai-Ago 2026'!AS58+'Set-Dez 2026'!AS58+'Jan-Abr 2027'!AS58","v":0},{"$nulls":3},0,0,0,null,0,0,0,0,0,{"$f":"'Jan-Abr 2025'!BH58","v":0},{"$f":"'Jan-Abr 2025'!BG58+'Mai-Ago 2025'!BG58+'Set-Dez 2025'!BG58+'Jan-Abr 2026'!BG58+'Mai-Ago 2026'!BG58+'Set-Dez 2026'!BG58+'Jan-Abr 2027'!BG58","v":0},{"$nulls":3},0,0,0,null,0,0,0,0,0,{"$f":"'Jan-Abr 2025'!BV58","v":0},{"$f":"'Jan-Abr 2025'!BU58+'Mai-Ago 2025'!BU58+'Set-Dez 2025'!BU58+'Jan-Abr 2026'!BU58+'Mai-Ago 2026'!BU58+'Set-Dez 2026'!BU58+'Jan-Abr 2027'!BU58","v":0}]
[null,349,"ASHST","Ambiente, Segurança, Higiene e Saúde no Trabalho",{"$nulls":5},"F423",25,{"$nulls":7},"6444","GS","Gestão de Stocks - Metodologias",{"$nulls":6},50,{"$nulls":8},0,0,0,null,0,0,0,0,0,{"$f":"'Jan-Abr 2025'!AT59","v":0},{"$f":"'Jan-Abr 2025'!AS59+'Mai-Ago 2025'!AS59+'Set-Dez 2025'!AS59+'Jan-Abr 2026'!AS59+'Mai-Ago 2026'!AS59+'Set-Dez 2026'!AS59+'Jan-Abr 2027'!AS59","v":0},{"$nulls":3},0,0,0,null,0,0,0,0,0,{"$f":"'Jan-Abr 2025'!BH59","v":0},{"$f":"'Jan-Abr 2025'!BG59+'Mai-Ago 2025'!BG59+'Set-Dez 2025'!BG59+'Jan-Abr 2026'!BG59+'Mai-Ago 2026'!BG59+'Set-Dez 2026'!BG59+'Jan-Abr 2027'!BG59","v":0},{"$nulls":3},0,0,0,null,0,0,0,0,0,{"$f":"'Jan-Abr 2025'!BV59","v":0},{"$f":"'Jan-Abr 2025'!BU59+'Mai-Ago 2025'!BU59+'Set-Dez 2025'!BU59+'Jan-Abr 2026'!BU59+'Mai-Ago 2026'!BU59+'Set-Dez 2026'!BU59+'Jan-Abr 2027'!BU59","v":0}]
[null,5653,"DT","Direito do Trabalho",{"$nulls":5},"B154",25,{"$nulls":7},"1054","CGO","Custeio e Gestão Orçamental",{"$nulls":6},50,{"$nulls":8},0,0,0,null,0,0,0,0,0,{"$f":"'Jan-Abr 2025'!AT60","v":0},{"$f":"'Jan-Abr 2025'!AS60+'Mai-Ago 2025'!AS60+'Set-Dez 2025'!AS60+'Jan-Abr 2026'!AS60+'Mai-Ago 2026'!AS60+'Set-Dez 2026'!AS60+'Jan-Abr 2027'!AS60","v":0},{"$nulls":3},0,0,0,null,0,0,0,0,0,{"$f":"'Jan-Abr 2025'!BH60","v":0},{"$f":"'Jan-Abr 2025'!BG60+'Mai-Ago 2025'!BG60+'Set-Dez 2025'!BG60+'Jan-Abr 2026'!BG60+'Mai-Ago 2026'!BG60+'Set-Dez 2026'!BG60+'Jan-Abr 2027'!BG60","v":0},{"$nulls":3},0,0,0,null,0,0,0,0,0,{"$f":"'Jan-Abr 2025'!BV60","v":0},{"$f":"'Jan-Abr 2025'!BU60+'Mai-Ago 2025'!BU60+'Set-Dez 2025'!BU60+'Jan-Abr 2026'!BU60+'Mai-Ago 2026'!BU60+'Set-Dez 2026'!BU60+'Jan-Abr 2027'!BU60","v":0}]
[null,5768,"ICS","Inglês em Contexto Socioprofissional",{"$nulls":5},"L046",25,{"$nulls":7},"6445","LOG","Logistica ",{"$nulls":6},50,{"$nulls":8},0,0,0,null,0,0,0,0,0,{"$f":"'Jan-Abr 2025'!AT61","v":0},{"$f":"'Jan-Abr 2025'!AS61+'Mai-Ago 2025'!AS61+'Set-Dez 2025'!AS61+'Jan-Abr 2026'!AS61+'Mai-Ago 2026'!AS61+'Set-Dez 2026'!AS61+'Jan-Abr 2027'!AS61","v":0},{"$nulls":3},0,0,0,null,0,0,0,0,0,{"$f":"'Jan-Abr 2025'!BH61","v":0},{"$f":"'Jan-Abr 2025'!BG61+'Mai-Ago 2025'!BG61+'Set-Dez 2025'!BG61+'Jan-Abr 2026'!BG61+'Mai-Ago 2026'!BG61+'Set-Dez 2026'!BG61+'Jan-Abr 2027'!BG61","v":0},{"$nulls":3},0,0,0,null,0,0,0,0,0,{"$f":"'Jan-Abr 2025'!BV61","v":0},{"$f":"'Jan-Abr 2025'!BU61+'Mai-Ago 2025'!BU61+'Set-Dez 2025'!BU61+'Jan-Abr 2026'!BU61+'Mai-Ago 2026'!BU61+'Set-Dez 2026'!BU61+'Jan-Abr 2027'!BU61","v":0}]
[{"$nulls":18},"6446","MOT","Métodos e Organização do Trabalho",{"$nulls":6},50,{"$nulls":8},0,0,0,null,0,0,0,0,0,{"$f":"'Jan-Abr 2025'!AT62","v":0},{"$f":"'Jan-Abr 2025'!AS62+'Mai-Ago 2025'!AS62+'Set-Dez 2025'!AS62+'Jan-Abr 2026'!AS62+'Mai-Ago 2026'!AS62+'Set-Dez 2026'!AS62+'Jan-Abr 2027'!AS62","v":0},{"$nulls":3},0,0,0,null,0,0,0,0,0,{"$f":"'Jan-Abr 2025'!BH62","v":0},{"$f":"'Jan-Abr 2025'!BG62+'Mai-Ago 2025'!BG62+'Set-Dez 2025'!BG62+'Jan-Abr 2026'!BG62+'Mai-Ago 2026'!BG62+'Set-Dez 2026'!BG62+'Jan-Abr 2027'!BG62","v":0},{"$nulls":3},0,0,0,null,0,0,0,0,0,{"$f":"'Jan-Abr 2025'!BV62","v":0},{"$f":"'Jan-Abr 2025'!BU62+'Mai-Ago 2025'!BU62+'Set-Dez 2025'!BU62+'Jan-Abr 2026'!BU62+'Mai-Ago 2026'!BU62+'Set-Dez 2026'!BU62+'Jan-Abr 2027'!BU62","v":0}]
[{"$nulls":18},"6447","SGI","Sistema de Gestão Integrada",{"$nulls":6},25,{"$nulls":8},0,0,0,null,0,0,0,0,0,{"$f":"'Jan-Abr 2025'!AT63","v":0},{"$f":"'Jan-Abr 2025'!AS63+'Mai-Ago 2025'!AS63+'Set-Dez 2025'!AS63+'Jan-Abr 2026'!AS63+'Mai-Ago 2026'!AS63+'Set-Dez 2026'!AS63+'Jan-Abr 2027'!AS63","v":0},{"$nulls":3},0,0,0,null,{"$f":"COUNTIF($C$10:$AG$18,$AX63)","v":0},{"$f":"COUNTIF($C$22:$AG$30,$AX63)","v":0},{"$f":"COUNTIF($C$34:$AG$42,$AX63)","v":0},{"$f":"COUNTIF($C$46:$AG$54,$AX63)","v":0},0,{"$f":"'Jan-Abr 2025'!BH63","v":0},{"$f":"'Jan-Abr 2025'!BG63+'Mai-Ago 2025'!BG63+'Set-Dez 2025'!BG63+'Jan-Abr 2026'!BG63+'Mai-Ago 2026'!BG63+'Set-Dez 2026'!BG63+'Jan-Abr 2027'!BG63","v":0},{"$nulls":3},0,0,0,null,0,0,0,0,0,{"$f":"'Jan-Abr 2025'!BV63","v":0},{"$f":"'Jan-Abr 2025'!BU63+'Mai-Ago 2025'!BU63+'Set-Dez 2025'!BU63+'Jan-Abr 2026'!BU63+'Mai-Ago 2026'!BU63+'Set-Dez 2026'!BU63+'Jan-Abr 2027'!BU63","v":0}]
["Tecnológica",6407,"PFL","Processos de Fundição / Ligação",{"$nulls":5},"D333",25,{"$nulls":7},"6448","QCEP","Qualidade - controlo estatístico de processo",{"$nulls":6},50,{"$nulls":8},0,0,0,null,0,0,0,0,0,{"$f":"'Jan-Abr 2025'!AT64","v":0},{"$f":"'Jan-Abr 2025'!AS64+'Mai-Ago 2025'!AS64+'Set-Dez 2025'!AS64+'Jan-Abr 2026'!AS64+'Mai-Ago 2026'!AS64+'Set-Dez 2026'!AS64+'Jan-Abr 2027'!AS64","v":0},{"$nulls":3},0,0,0,null,0,0,0,0,0,{"$f":"'Jan-Abr 2025'!BH64","v":0},{"$f":"'Jan-Abr 2025'!BG64+'Mai-Ago 2025'!BG64+'Set-Dez 2025'!BG64+'Jan-Abr 2026'!BG64+'Mai-Ago 2026'!BG64+'Set-Dez 2026'!BG64+'Jan-Abr 2027'!BG64","v":0},{"$nulls":3},0,0,0,null,0,0,0,0,0,{"$f":"'Jan-Abr 2025'!BV64","v":0},{"$f":"'Jan-Abr 2025'!BU64+'Mai-Ago 2025'!BU64+'Set-Dez 2025'!BU64+'Jan-Abr 2026'!BU64+'Mai-Ago 2026'!BU64+'Set-Dez 2026'!BU64+'Jan-Abr 2027'!BU64","v":0}]
[null,6408,"PCC","Processos de Conformação / Corte",{"$nulls":5},"D334",25,{"$nulls":25},0,0,0,null,0,0,0,0,0,{"$f":"'Jan-Abr 2025'!AT65","v":0},{"$f":"'Jan-Abr 2025'!AS65+'Mai-Ago 2025'!AS65+'Set-Dez 2025'!AS65+'Jan-Abr 2026'!AS65+'Mai-Ago 2026'!AS65+'Set-Dez 2026'!AS65+'Jan-Abr 2027'!AS65","v":0},{"$nulls":3},0,0,0,null,0,0,0,0,0,{"$f":"'Jan-Abr 2025'!BH65","v":0},{"$f":"'Jan-Abr 2025'!BG65+'Mai-Ago 2025'!BG65+'Set-Dez 2025'!BG65+'Jan-Abr 2026'!BG65+'Mai-Ago 2026'!BG65+'Set-Dez 2026'!BG65+'Jan-Abr 2027'!BG65","v":0},{"$nulls":3},0,0,0,null,0,0,0,{"$f":"COUNTIF($C$46:$AG$54,$BL65)","v":0},0,{"$f":"'Jan-Abr 2025'!BV65","v":0},{"$f":"'Jan-Abr 2025'!BU65+'Mai-Ago 2025'!BU65+'Set-Dez 2025'!BU65+'Jan-Abr 2026'!BU65+'Mai-Ago 2026'!BU65+'Set-Dez 2026'!BU65+'Jan-Abr 2027'!BU65","v":0}]
[null,6409,"PAA","Processos por Arranque de Apara",{"$nulls":5},"C588",25,{"$nulls":25},0,0,0,null,0,0,0,0,0,{"$f":"'Jan-Abr 2025'!AT66","v":0},{"$f":"'Jan-Abr 2025'!AS66+'Mai-Ago 2025'!AS66+'Set-Dez 2025'!AS66+'Jan-Abr 2026'!AS66+'Mai-Ago 2026'!AS66+'Set-Dez 2026'!AS66+'Jan-Abr 2027'!AS66","v":0},{"$nulls":3},0,0,0,null,0,0,0,0,0,{"$f":"'Jan-Abr 2025'!BH66","v":0},{"$f":"'Jan-Abr 2025'!BG66+'Mai-Ago 2025'!BG66+'Set-Dez 2025'!BG66+'Jan-Abr 2026'!BG66+'Mai-Ago 2026'!BG66+'Set-Dez 2026'!BG66+'Jan-Abr 2027'!BG66","v":0},{"$nulls":3},0,0,0,null,0,0,0,0,0,{"$f":"'Jan-Abr 2025'!BV66","v":0},{"$f":"'Jan-Abr 2025'!BU66+'Mai-Ago 2025'!BU66+'Set-Dez 2025'!BU66+'Jan-Abr 2026'!BU66+'Mai-Ago 2026'!BU66+'Set-Dez 2026'!BU66+'Jan-Abr 2027'!BU66","v":0}]
[null,6410,"IME","Instalação de Máquinas Elétricas",{"$nulls":5},"K252",50,{"$nulls":25},0,0,0,null,0,0,0,0,0,{"$f":"'Jan-Abr 2025'!AT67","v":0},{"$f":"'Jan-Abr 2025'!AS67+'Mai-Ago 2025'!AS67+'Set-Dez 2025'!AS67+'Jan-Abr 2026'!AS67+'Mai-Ago 2026'!AS67+'Set-Dez 2026'!AS67+'Jan-Abr 2027'!AS67","v":0},{"$nulls":3},0,0,0,null,0,0,0,0,0,{"$f":"'Jan-Abr 2025'!BH67","v":0},{"$f":"'Jan-Abr 2025'!BG67+'Mai-Ago 2025'!BG67+'Set-Dez 2025'!BG67+'Jan-Abr 2026'!BG67+'Mai-Ago 2026'!BG67+'Set-Dez 2026'!BG67+'Jan-Abr 2027'!BG67","v":0},{"$nulls":3},0,0,0,null,0,0,0,0,0,{"$f":"'Jan-Abr 2025'!BV67","v":0},{"$f":"'Jan-Abr 2025'!BU67+'Mai-Ago 2025'!BU67+'Set-Dez 2025'!BU67+'Jan-Abr 2026'!BU67+'Mai-Ago 2026'!BU67+'Set-Dez 2026'!BU67+'Jan-Abr 2027'!BU67","v":0}]
[null,6411,"ELE","Eletrónica",{"$nulls":5},"K253",50,{"$nulls":25},0,0,0,null,0,0,0,0,0,{"$f":"'Jan-Abr 2025'!AT68","v":0},{"$f":"'Jan-Abr 2025'!AS68+'Mai-Ago 2025'!AS68+'Set-Dez 2025'!AS68+'Jan-Abr 2026'!AS68+'Mai-Ago 2026'!AS68+'Set-Dez 2026'!AS68+'Jan-Abr 2027'!AS68","v":0},{"$nulls":3},0,0,0,null,0,0,0,0,0,{"$f":"'Jan-Abr 2025'!BH68","v":0},{"$f":"'Jan-Abr 2025'!BG68+'Mai-Ago 2025'!BG68+'Set-Dez 2025'!BG68+'Jan-Abr 2026'!BG68+'Mai-Ago 2026'!BG68+'Set-Dez 2026'!BG68+'Jan-Abr 2027'!BG68","v":0},{"$nulls":3},0,0,0,null,0,0,0,0,0,{"$f":"'Jan-Abr 2025'!BV68","v":0},{"$f":"'Jan-Abr 2025'!BU68+'Mai-Ago 2025'!BU68+'Set-Dez 2025'!BU68+'Jan-Abr 2026'!BU68+'Mai-Ago 2026'!BU68+'Set-Dez 2026'!BU68+'Jan-Abr 2027'!BU68","v":0}]
[null,6412,"CP","Circuitos Pneumáticos",{"$nulls":5},"E329",25,{"$nulls":25},0,0,0,null,0,0,0,0,0,{"$f":"'Jan-Abr 2025'!AT69","v":0},{"$f":"'Jan-Abr 2025'!AS69+'Mai-Ago 2025'!AS69+'Set-Dez 2025'!AS69+'Jan-Abr 2026'!AS69+'Mai-Ago 2026'!AS69+'Set-Dez 2026'!AS69+'Jan-Abr 2027'!AS69","v":0},{"$nulls":3},0,0,0,null,0,0,0,0,0,{"$f":"'Jan-Abr 2025'!BH69","v":0},{"$f":"'Jan-Abr 2025'!BG69+'Mai-Ago 2025'!BG69+'Set-Dez 2025'!BG69+'Jan-Abr 2026'!BG69+'Mai-Ago 2026'!BG69+'Set-Dez 2026'!BG69+'Jan-Abr 2027'!BG69","v":0},{"$nulls":3},0,0,0,null,0,0,0,0,0,{"$f":"'Jan-Abr 2025'!BV69","v":0},{"$f":"'Jan-Abr 2025'!BU69+'Mai-Ago 2025'!BU69+'Set-Dez 2025'!BU69+'Jan-Abr 2026'!BU69+'Mai-Ago 2026'!BU69+'Set-Dez 2026'!BU69+'Jan-Abr 2027'!BU69","v":0}]
[null,6413,"CH","Circuitos Óleo-Hidráulicos",{"$nulls":5},"E330",25,{"$nulls":6},"Estágio",null,"PCT","Prática em Contexto Trabalho",{"$nulls":5},"E368",560,{"$nulls":8},0,0,0,null,0,0,0,0,0,{"$f":"'Jan-Abr 2025'!AT70","v":0},{"$f":"'Jan-Abr 2025'!AS70+'Mai-Ago 2025'!AS70+'Set-Dez 2025'!AS70+'Jan-Abr 2026'!AS70+'Mai-Ago 2026'!AS70+'Set-Dez 2026'!AS70+'Jan-Abr 2027'!AS70","v":0},{"$nulls":3},0,0,0,null,0,0,0,0,0,{"$f":"'Jan-Abr 2025'!BH70","v":0},{"$f":"'Jan-Abr 2025'!BG70+'Mai-Ago 2025'!BG70+'Set-Dez 2025'!BG70+'Jan-Abr 2026'!BG70+'Mai-Ago 2026'!BG70+'Set-Dez 2026'!BG70+'Jan-Abr 2027'!BG70","v":0},{"$nulls":3},0,0,0,null,0,0,0,0,0,{"$f":"'Jan-Abr 2025'!BV70","v":0},{"$f":"'Jan-Abr 2025'!BU70+'Mai-Ago 2025'!BU70+'Set-Dez 2025'!BU70+'Jan-Abr 2026'!BU70+'Mai-Ago 2026'!BU70+'Set-Dez 2026'!BU70+'Jan-Abr 2027'!BU70","v":0}]
[null,6414,"CLP","Controladores Lógicos Programáveis",{"$nulls":5},"C589",50,{"$nulls":25},0,0,0,null,0,0,0,0,0,{"$f":"'Jan-Abr 2025'!AT71","v":0},{"$f":"'Jan-Abr 2025'!AS71+'Mai-Ago 2025'!AS71+'Set-Dez 2025'!AS71+'Jan-Abr 2026'!AS71+'Mai-Ago 2026'!AS71+'Set-Dez 2026'!AS71+'Jan-Abr 2027'!AS71","v":0},{"$nulls":3},0,0,0,null,0,0,0,0,0,{"$f":"'Jan-Abr 2025'!BH71","v":0},{"$f":"'Jan-Abr 2025'!BG71+'Mai-Ago 2025'!BG71+'Set-Dez 2025'!BG71+'Jan-Abr 2026'!BG71+'Mai-Ago 2026'!BG71+'Set-Dez 2026'!BG71+'Jan-Abr 2027'!BG71","v":0},{"$nulls":3},0,0,0,null,0,0,0,0,0,{"$f":"'Jan-Abr 2025'!BV71","v":0},{"$f":"'Jan-Abr 2025'!BU71+'Mai-Ago 2025'!BU71+'Set-Dez 2025'!BU71+'Jan-Abr 2026'!BU71+'Mai-Ago 2026'!BU71+'Set-Dez 2026'!BU71+'Jan-Abr 2027'!BU71","v":0}]
[null,6415,"DCM","Desenho de Construções Mecânicas",{"$nulls":5},"A438",50,{"$nulls":25},{"$f":"IF(AI72=$DC$8,AM72,IF(AI72=$DC$9,AM72,IF(AI72=$DC$10,AL72,)))","v":0},0,{"$f":"IF(AI72=$DC$8,AL72,IF(AI72=$DC$9,AM73+AL72,IF(AI72=$DC$10,IF(AI73=$DC$10,AM73+AL72,AL72),)))","v":0},null,0,0,0,0,{"$f":"SUM(AO72:AR72)","v":0},{"$f":"'Jan-Abr 2025'!AT72","v":0},{"$f":"'Jan-Abr 2025'!AS72+'Mai-Ago 2025'!AS72+'Set-Dez 2025'!AS72+'Jan-Abr 2026'!AS72+'Mai-Ago 2026'!AS72+'Set-Dez 2026'!AS72+'Jan-Abr 2027'!AS72","v":0},{"$nulls":3},{"$f":"IF(AW72=$DC$8,BA72,IF(AW72=$DC$9,BA72,IF(AW72=$DC$10,AZ72,)))","v":0},0,{"$f":"IF(AW72=$DC$8,AZ72,IF(AW72=$DC$9,BA73+AZ72,IF(AW72=$DC$10,IF(AW73=$DC$10,BA73+AZ72,AZ72),)))","v":0},null,0,0,0,0,0,{"$f":"'Jan-Abr 2025'!BH72","v":0},{"$f":"'Jan-Abr 2025'!BG72+'Mai-Ago 2025'!BG72+'Set-Dez 2025'!BG72+'Jan-Abr 2026'!BG72+'Mai-Ago 2026'!BG72+'Set-Dez 2026'!BG72+'Jan-Abr 2027'!BG72","v":0},{"$nulls":3},{"$f":"IF(BK72=$DC$8,BO72,IF(BK72=$DC$9,BO72,IF(BK72=$DC$10,BN72,)))","v":0},0,{"$f":"IF(BK72=$DC$8,BN72,IF(BK72=$DC$9,BO73+BN72,IF(BK72=$DC$10,IF(BK73=$DC$10,BO73+BN72,BN72),)))","v":0},null,0,0,0,0,{"$f":"SUM(BQ72:BT72)","v":0},{"$f":"'Jan-Abr 2025'!BV72","v":0},{"$f":"'Jan-Abr 2025'!BU72+'Mai-Ago 2025'!BU72+'Set-Dez 2025'!BU72+'Jan-Abr 2026'!BU72+'Mai-Ago 2026'!BU72+'Set-Dez 2026'!BU72+'Jan-Abr 2027'!BU72","v":0}]
[null,6416,"CM","Ciência dos Materiais",{"$nulls":5},"C590",50,{"$nulls":25},0,{"$f":"IF($AK$4=$DB$8,AS73,IF($AK$4=$DB$9,AT73,IF($AK$4=$DB$10,AU73,IF($AK$4=$DB$11,AO73,IF($AK$4=$DB$12,AP73,IF($AK$4=$DB$13,AQ73,IF($AK$4=$DB$14,AR73,\"\")))))))","v":0},0,null,{"$f":"COUNTIF($C$10:$AG$18,$AJ73)","v":0},{"$f":"COUNTIF($C$22:$AG$30,$AJ73)","v":0},{"$f":"COUNTIF($C$34:$AG$42,$AJ73)","v":0},{"$f":"COUNTIF($C$46:$AG$54,$AJ73)","v":0},0,{"$f":"'Jan-Abr 2025'!AT73","v":0},{"$f":"'Jan-Abr 2025'!AS73+'Mai-Ago 2025'!AS73+'Set-Dez 2025'!AS73+'Jan-Abr 2026'!AS73+'Mai-Ago 2026'!AS73+'Set-Dez 2026'!AS73+'Jan-Abr 2027'!AS73","v":0},{"$nulls":3},0,{"$f":"IF($AK$4=$DB$8,BG73,IF($AK$4=$DB$9,BH73,IF($AK$4=$DB$10,BI73,IF($AK$4=$DB$11,BC73,IF($AK$4=$DB$12,BD73,IF($AK$4=$DB$13,BE73,IF($AK$4=$DB$14,BF73,\"\")))))))","v":0},0,null,{"$f":"COUNTIF($C$10:$AG$18,$AX73)","v":0},{"$f":"COUNTIF($C$22:$AG$30,$AX73)","v":0},{"$f":"COUNTIF($C$34:$AG$42,$AX73)","v":0},{"$f":"COUNTIF($C$46:$AG$54,$AX73)","v":0},{"$f":"SUM(BC73:BF73)","v":0},{"$f":"'Jan-Abr 2025'!BH73","v":0},{"$f":"'Jan-Abr 2025'!BG73+'Mai-Ago 2025'!BG73+'Set-Dez 2025'!BG73+'Jan-Abr 2026'!BG73+'Mai-Ago 2026'!BG73+'Set-Dez 2026'!BG73+'Jan-Abr 2027'!BG73","v":0},{"$nulls":3},0,{"$f":"IF($AK$4=$DB$8,BU73,IF($AK$4=$DB$9,BV73,IF($AK$4=$DB$10,BW73,IF($AK$4=$DB$11,BQ73,IF($AK$4=$DB$12,BR73,IF($AK$4=$DB$13,BS73,IF($AK$4=$DB$14,BT73,\"\")))))))","v":0},0,null,{"$f":"COUNTIF($C$10:$AG$18,$BL73)","v":0},{"$f":"COUNTIF($C$22:$AG$30,$BL73)","v":0},{"$f":"COUNTIF($C$34:$AG$42,$BL73)","v":0},{"$f":"COUNTIF($C$46:$AG$54,$BL73)","v":0},0,{"$f":"'Jan-Abr 2025'!BV73","v":0},{"$f":"'Jan-Abr 2025'!BU73+'Mai-Ago 2025'!BU73+'Set-Dez 2025'!BU73+'Jan-Abr 2026'!BU73+'Mai-Ago 2026'!BU73+'Set-Dez 2026'!BU73+'Jan-Abr 2027'!BU73","v":0}]
[null,6417,"SD","Sistemas Digitais",{"$nulls":5},"I159",50,{"$nulls":9},"Seg.","Ter.","Qua.","Qui.","Sex."]
[{"$nulls":19},"Salas:",{"$nulls":16},{"$f":"SUMIF(AI8:AI73,\"=M\",AK8:AK73)+SUMIF(AI8:AI73,\"=T\",AK8:AK73)","v":0},null,null,{"$f":"SUMIF(AI8:AI73,\"=M\",AN8:AN73)+SUMIF(AI8:AI73,\"=T\",AN8:AN73)","v":0},{"$nulls":10},{"$f":"SUMIF(AW8:AW73,\"=M\",AY8:AY73)+SUMIF(AW8:AW73,\"=T\",AY8:AY73)","v":0},null,null,{"$f":"SUMIF(AW8:AW73,\"=M\",BB8:BB73)+SUMIF(AW8:AW73,\"=T\",BB8:BB73)","v":0},{"$nulls":10},{"$f":"SUMIF(BK8:BK73,\"=M\",BM8:BM73)+SUMIF(BK8:BK73,\"=T\",BM8:BM73)","v":0},null,null,{"$f":"SUMIF(BK8:BK73,\"=M\",BP8:BP73)+SUMIF(BK8:BK73,\"=T\",BP8:BP73)","v":0}]
[{"$nulls":34},"Totais",null,{"$f":"AK75+AY75+BM75","v":0},null,null,{"$f":"AN75+BB75+BP75","v":0}]
["R. Quantitativas:"]

{"sheet":"Mai-Ago 2027","index":8,"n_rows":77,"n_cols":107,"rows_kept":77,"merged":[[0,25,0,32],[0,34,2,39],[0,40,6,40],[0,41,6,41],[0,42,6,42],[0,43,6,43],[0,44,6,44],[0,45,6,45],[0,46,6,46],[0,48,2,53],[0,54,6,54],[0,55,6,55],[0,56,6,56],[0,57,6,57],[0,58,6,58],[0,59,6,59],[0,60,6,60],[0,62,2,67],[0,68,6,68],[0,69,6,69],[0,70,6,70],[0,71,6,71],[0,72,6,72],[0,73,6,73],[0,74,6,74],[0,105,6,105],[0,106,6,106],[1,25,1,32],[2,25,2,32],[3,25,3,32],[3,34,6,34],[3,35,6,35],[3,36,6,36],[3,37,6,37],[3,38,6,38],[3,39,6,39],[3,48,6,48],[3,49,6,49],[3,50,6,50],[3,51,6,51],[3,52,6,52],[3,53,6,53],[3,62,6,62],[3,63,6,63],[3,64,6,64],[3,65,6,65],[3,66,6,66],[3,67,6,67],[4,0,4,2],[4,3,4,9],[4,10,4,13],[4,14,4,21],[4,22,4,26],[4,27,4,29],[4,30,4,32],[5,0,5,2],[5,3,5,9],[5,10,5,13],[5,14,5,21],[5,22,5,26],[5,27,5,29],[5,30,5,32],[6,0,6,2],[6,3,6,9],[6,10,6,13],[6,14,6,21],[6,22,6,26],[6,27,6,29],[6,30,6,32],[7,0,8,1],[9,0,9,1],[10,0,10,1],[11,0,11,1],[12,0,12,1],[14,0,14,1],[15,0,15,1],[16,0,16,1],[17,0,17,1],[19,0,20,1],[21,0,21,1],[22,0,22,1],[23,0,23,1],[24,0,24,1],[25,0,25,1],[26,0,26,1],[27,0,27,1],[28,0,28,1],[29,0,29,1],[31,0,32,1],[33,0,33,1],[34,0,34,1],[35,0,35,1],[36,0,36,1],[37,0,37,1],[38,0,38,1],[39,0,39,1],[40,0,40,1],[41,0,41,1],[43,0,44,1],[45,0,45,1],[46,0,46,1],[47,0,47,1],[48,0,48,1],[49,0,49,1],[50,0,50,1],[51,0,51,1],[52,0,52,1],[53,0,53,1],[54,2,54,8],[54,11,54,13],[54,17,54,19],[54,20,54,25],[54,28,54,30],[55,0,60,0],[55,3,55,8],[55,11,55,13],[55,17,63,17],[55,20,55,25],[55,28,55,30],[56,3,56,8],[56,11,56,13],[56,20,56,25],[56,28,56,30],[57,3,57,8],[57,11,57,13],[57,20,57,25],[57,28,57,30],[58,3,58,8],[58,11,58,13],[58,20,58,25],[58,28,58,30],[59,3,59,8],[59,11,59,13],[59,20,59,25],[59,28,59,30],[60,3,60,8],[60,11,60,13],[60,20,60,25],[60,28,60,30],[61,20,61,25],[61,28,61,30],[62,20,62,25],[63,0,73,0],[63,3,63,8],[63,11,63,13],[63,20,63,25],[64,3,64,8],[64,11,64,13],[65,3,65,8],[65,11,65,13],[66,3,66,8],[66,11,66,13],[67,3,67,8],[67,11,67,13],[68,3,68,8],[68,11,68,13],[69,3,69,8],[69,11,69,13],[70,3,70,8],[70,11,70,13],[71,3,71,8],[71,11,71,13],[72,3,72,8],[72,11,72,13],[73,3,73,8],[73,11,73,13],[75,34,75,35],[76,2,76,3],[76,4,76,5],[76,6,76,7],[76,8,76,9],[76,10,76,11],[76,12,76,13]]}
[{"$nulls":40},{"$f":"TEXT($A$8,\"mmm\")","v":"mai"},{"$f":"TEXT($A$20,\"mmm\")","v":"jun"},{"$f":"TEXT($A$32,\"mmm\")","v":"jul"},{"$f":"TEXT($A$44,\"mmm\")","v":"ago"},"Total  Folha","Total Global","Total  Acum.",{"$nulls":7},{"$f":"TEXT($A$8,\"mmm\")","v":"mai"},{"$f":"TEXT($A$20,\"mmm\")","v":"jun"},{"$f":"TEXT($A$32,\"mmm\")","v":"jul"},{"$f":"TEXT($A$44,\"mmm\")","v":"ago"},"Total  Folha","Total Global","Total  Acum.",{"$nulls":7},{"$f":"TEXT($A$8,\"mmm\")","v":"mai"},{"$f":"TEXT($A$20,\"mmm\")","v":"jun"},{"$f":"TEXT($A$32,\"mmm\")","v":"jul"},{"$f":"TEXT($A$44,\"mmm\")","v":"ago"},"Total  Folha","Total Global","Total  Acum.",{"$nulls":30},"tipo_soma","tipo_contador"]
[{"$nulls":25},"Director(a):"]
[{"$nulls":25},"(Cristina Botas)"]
[{"$nulls":34},"Tipo","Módulo","ST","Origem","Cálculo","Objetivo",{"$nulls":8},"Tipo","Módulo",{"$f":"AK4","v":"ST"},"Origem","Cálculo","Objetivo",{"$nulls":8},"Tipo","Módulo",{"$f":"AK4","v":"ST"},"Origem","Cálculo","Objetivo"]
["MODALIDADE:",{"$nulls":9},"CODÍGO DA AÇÃO:",{"$nulls":16},"       U.O.:",null,null,"Torres Vedras"]
["PLANEAMENTO:",{"$nulls":9},"SAÍDA PROFISSIONAL: Técnico/a Especialista em Mecatrónica",{"$nulls":16},"DATA INÍCIO:"]
["COORDENADOR:",{"$nulls":9},"DURAÇÃO:",{"$nulls":16},"DATA FIM  (previsto):"]
["2027-05-01",null,{"$f":"IF(C9<>\"\",CHOOSE(WEEKDAY(C9,1),\"Dom.\",\"Seg.\",\"Ter.\",\"Qua.\",\"Qui.\",\"Sex.\",\"Sáb.\"),\"\")","v":"Sáb."},{"$f":"IF(D9<>\"\",CHOOSE(WEEKDAY(D9,1),\"Dom.\",\"Seg.\",\"Ter.\",\"Qua.\",\"Qui.\",\"Sex.\",\"Sáb.\"),\"\")","v":"Dom."},"Seg.","Ter.","Qua.","Qui.","Sex.","Sáb.","Dom.","Seg.","Ter.","Qua.","Qui.","Sex.","Sáb.","Dom.","Seg.","Ter.","Qua.","Qui.","Sex.","Sáb.","Dom.","Seg.","Ter.","Qua.","Qui.","Sex.","Sáb.","Dom.","Seg.",null,null,"IGO",{"$f":"IF(AI8=$DC$8,AM8,IF(AI8=$DC$9,AM8,IF(AI8=$DC$10,AL8,)))","v":0},{"$f":"IF($AK$4=$DB$8,AS8,IF($AK$4=$DB$9,AT8,IF($AK$4=$DB$10,AU8,IF($AK$4=$DB$11,AO8,IF($AK$4=$DB$12,AP8,IF($AK$4=$DB$13,AQ8,IF($AK$4=$DB$14,AR8,\"\")))))))","v":0},{"$f":"IF(AI8=$DC$8,AL8,IF(AI8=$DC$9,AM9+AL8,IF(AI8=$DC$10,IF(AI9=$DC$10,AM9+AL8,AL8),)))","v":0},25,{"$f":"COUNTIF($C$10:$AG$18,$AJ8)","v":0},{"$f":"COUNTIF($C$22:$AG$30,$AJ8)","v":0},{"$f":"COUNTIF($C$34:$AG$42,$AJ8)","v":0},{"$f":"COUNTIF($C$46:$AG$54,$AJ8)","v":0},{"$f":"SUM(AO8:AR8)","v":0},{"$f":"'Jan-Abr 2025'!AT8","v":0},{"$f":"'Jan-Abr 2025'!AS8+'Mai-Ago 2025'!AS8+'Set-Dez 2025'!AS8+'Jan-Abr 2026'!AS8+'Mai-Ago 2026'!AS8+'Set-Dez 2026'!AS8+'Jan-Abr 2027'!AS8+'Mai-Ago 2027'!AS8","v":0},{"$nulls":3},{"$f":"IF(AW8=$DC$8,BA8,IF(AW8=$DC$9,BA8,IF(AW8=$DC$10,AZ8,)))","v":0},{"$f":"IF($AK$4=$DB$8,BG8,IF($AK$4=$DB$9,BH8,IF($AK$4=$DB$10,BI8,IF($AK$4=$DB$11,BC8,IF($AK$4=$DB$12,BD8,IF($AK$4=$DB$13,BE8,IF($AK$4=$DB$14,BF8,\"\")))))))","v":0},{"$f":"IF(AW8=$DC$8,AZ8,IF(AW8=$DC$9,BA9+AZ8,IF(AW8=$DC$10,IF(AW9=$DC$10,BA9+AZ8,AZ8),)))","v":0},null,{"$f":"COUNTIF($C$10:$AG$18,$AX8)","v":0},{"$f":"COUNTIF($C$22:$AG$30,$AX8)","v":0},{"$f":"COUNTIF($C$34:$AG$42,$AX8)","v":0},{"$f":"COUNTIF($C$46:$AG$54,$AX8)","v":0},{"$f":"SUM(BC8:BF8)","v":0},{"$f":"'Jan-Abr 2025'!BH8","v":0},{"$f":"'Jan-Abr 2025'!BG8+'Mai-Ago 2025'!BG8+'Set-Dez 2025'!BG8+'Jan-Abr 2026'!BG8+'Mai-Ago 2026'!BG8+'Set-Dez 2026'!BG8+'Jan-Abr 2027'!BG8+'Mai-Ago 2027'!BG8","v":0},{"$nulls":3},{"$f":"IF(BK8=$DC$8,BO8,IF(BK8=$DC$9,BO8,IF(BK8=$DC$10,BN8,)))","v":0},{"$f":"IF($AK$4=$DB$8,BU8,IF($AK$4=$DB$9,BV8,IF($AK$4=$DB$10,BW8,IF($AK$4=$DB$11,BQ8,IF($AK$4=$DB$12,BR8,IF($AK$4=$DB$13,BS8,IF($AK$4=$DB$14,BT8,\"\")))))))","v":0},{"$f":"IF(BK8=$DC$8,BN8,IF(BK8=$DC$9,BO9+BN8,IF(BK8=$DC$10,IF(BK9=$DC$10,BO9+BN8,BN8),)))","v":0},null,{"$f":"COUNTIF($C$10:$AG$18,$BL8)","v":0},{"$f":"COUNTIF($C$22:$AG$30,$BL8)","v":0},{"$f":"COUNTIF($C$34:$AG$42,$BL8)","v":0},{"$f":"COUNTIF($C$46:$AG$54,$BL8)","v":0},{"$f":"SUM(BQ8:BT8)","v":0},{"$f":"'Jan-Abr 2025'!BV8","v":0},{"$f":"'Jan-Abr 2025'!BU8+'Mai-Ago 2025'!BU8+'Set-Dez 2025'!BU8+'Jan-Abr 2026'!BU8+'Mai-Ago 2026'!BU8+'Set-Dez 2026'!BU8+'Jan-Abr 2027'!BU8+'Mai-Ago 2027'!BU8","v":0},{"$nulls":30},"SF","M"]
[null,null,{"$f":"A8","v":"2027-05-01"},{"$f":"IF(C9=\"\",\"\",IF(DAY(C9)<DAY(EOMONTH(C9,0)),C9+1,\"\"))","v":"2027-05-02"},{"$f":"IF(D9=\"\",\"\",IF(DAY(D9)<DAY(EOMONTH(D9,0)),D9+1,\"\"))","v":"2027-05-03"},"2027-05-04","2027-05-05","2027-05-06","2027-05-07","2027-05-08",{"$f":"IF(J9=\"\",\"\",IF(DAY(J9)<DAY(EOMONTH(J9,0)),J9+1,\"\"))","v":"2027-05-09"},{"$f":"IF(K9=\"\",\"\",IF(DAY(K9)<DAY(EOMONTH(K9,0)),K9+1,\"\"))","v":"2027-05-10"},"2027-05-11","2027-05-12","2027-05-13","2027-05-14","2027-05-15",{"$f":"IF(Q9=\"\",\"\",IF(DAY(Q9)<DAY(EOMONTH(Q9,0)),Q9+1,\"\"))","v":"2027-05-16"},{"$f":"IF(R9=\"\",\"\",IF(DAY(R9)<DAY(EOMONTH(R9,0)),R9+1,\"\"))","v":"2027-05-17"},"2027-05-18","2027-05-19","2027-05-20","2027-05-21","2027-05-22",{"$f":"IF(X9=\"\",\"\",IF(DAY(X9)<DAY(EOMONTH(X9,0)),X9+1,\"\"))","v":"2027-05-23"},{"$f":"IF(Y9=\"\",\"\",IF(DAY(Y9)<DAY(EOMONTH(Y9,0)),Y9+1,\"\"))","v":"2027-05-24"},"2027-05-25","2027-05-26","2027-05-27","2027-05-28","2027-05-29",{"$f":"IF(AE9=\"\",\"\",IF(DAY(AE9)<DAY(EOMONTH(AE9,0)),AE9+1,\"\"))","v":"2027-05-30"},{"$f":"IF(AF9=\"\",\"\",IF(DAY(AF9)<DAY(EOMONTH(AF9,0)),AF9+1,\"\"))","v":"2027-05-31"},null,null,"GMQ",0,{"$f":"IF($AK$4=$DB$8,AS9,IF($AK$4=$DB$9,AT9,IF($AK$4=$DB$10,AU9,IF($AK$4=$DB$11,AO9,IF($AK$4=$DB$12,AP9,IF($AK$4=$DB$13,AQ9,IF($AK$4=$DB$14,AR9,\"\")))))))","v":0},0,25,{"$f":"COUNTIF($C$10:$AG$18,$AJ9)","v":0},{"$f":"COUNTIF($C$22:$AG$30,$AJ9)","v":0},{"$f":"COUNTIF($C$34:$AG$42,$AJ9)","v":0},{"$f":"COUNTIF($C$46:$AG$54,$AJ9)","v":0},0,{"$f":"'Jan-Abr 2025'!AT9","v":0},{"$f":"'Jan-Abr 2025'!AS9+'Mai-Ago 2025'!AS9+'Set-Dez 2025'!AS9+'Jan-Abr 2026'!AS9+'Mai-Ago 2026'!AS9+'Set-Dez 2026'!AS9+'Jan-Abr 2027'!AS9+'Mai-Ago 2027'!AS9","v":0},{"$nulls":3},0,{"$f":"IF($AK$4=$DB$8,BG9,IF($AK$4=$DB$9,BH9,IF($AK$4=$DB$10,BI9,IF($AK$4=$DB$11,BC9,IF($AK$4=$DB$12,BD9,IF($AK$4=$DB$13,BE9,IF($AK$4=$DB$14,BF9,\"\")))))))","v":0},0,null,{"$f":"COUNTIF($C$10:$AG$18,$AX9)","v":0},{"$f":"COUNTIF($C$22:$AG$30,$AX9)","v":0},{"$f":"COUNTIF($C$34:$AG$42,$AX9)","v":0},{"$f":"COUNTIF($C$46:$AG$54,$AX9)","v":0},{"$f":"SUM(BC9:BF9)","v":0},{"$f":"'Jan-Abr 2025'!BH9","v":0},{"$f":"'Jan-Abr 2025'!BG9+'Mai-Ago 2025'!BG9+'Set-Dez 2025'!BG9+'Jan-Abr 2026'!BG9+'Mai-Ago 2026'!BG9+'Set-Dez 2026'!BG9+'Jan-Abr 2027'!BG9+'Mai-Ago 2027'!BG9","v":0},{"$nulls":3},0,{"$f":"IF($AK$4=$DB$8,BU9,IF($AK$4=$DB$9,BV9,IF($AK$4=$DB$10,BW9,IF($AK$4=$DB$11,BQ9,IF($AK$4=$DB$12,BR9,IF($AK$4=$DB$13,BS9,IF($AK$4=$DB$14,BT9,\"\")))))))","v":0},0,null,{"$f":"COUNTIF($C$10:$AG$18,$BL9)","v":0},{"$f":"COUNTIF($C$22:$AG$30,$BL9)","v":0},{"$f":"COUNTIF($C$34:$AG$42,$BL9)","v":0},{"$f":"COUNTIF($C$46:$AG$54,$BL9)","v":0},0,{"$f":"'Jan-Abr 2025'!BV9","v":0},{"$f":"'Jan-Abr 2025'!BU9+'Mai-Ago 2025'!BU9+'Set-Dez 2025'!BU9+'Jan-Abr 2026'!BU9+'Mai-Ago 2026'!BU9+'Set-Dez 2026'!BU9+'Jan-Abr 2027'!BU9+'Mai-Ago 2027'!BU9","v":0},{"$nulls":30},"ST","T"]
["09h00 - 09h50",{"$nulls":27},"Corpo",{"$nulls":6},"SGQ",0,0,0,25,0,0,0,0,0,{"$f":"'Jan-Abr 2025'!AT10","v":0},{"$f":"'Jan-Abr 2025'!AS10+'Mai-Ago 2025'!AS10+'Set-Dez 2025'!AS10+'Jan-Abr 2026'!AS10+'Mai-Ago 2026'!AS10+'Set-Dez 2026'!AS10+'Jan-Abr 2027'!AS10+'Mai-Ago 2027'!AS10","v":0},{"$nulls":3},0,0,0,null,0,0,0,0,0,{"$f":"'Jan-Abr 2025'!BH10","v":0},{"$f":"'Jan-Abr 2025'!BG10+'Mai-Ago 2025'!BG10+'Set-Dez 2025'!BG10+'Jan-Abr 2026'!BG10+'Mai-Ago 2026'!BG10+'Set-Dez 2026'!BG10+'Jan-Abr 2027'!BG10+'Mai-Ago 2027'!BG10","v":0},{"$nulls":3},0,0,0,null,0,0,0,0,0,{"$f":"'Jan-Abr 2025'!BV10","v":0},{"$f":"'Jan-Abr 2025'!BU10+'Mai-Ago 2025'!BU10+'Set-Dez 2025'!BU10+'Jan-Abr 2026'!BU10+'Mai-Ago 2026'!BU10+'Set-Dez 2026'!BU10+'Jan-Abr 2027'!BU10+'Mai-Ago 2027'!BU10","v":0},{"$nulls":30},"SA","P"]
["09h50 - 10h40",null,"Trab.",{"$nulls":25},"de",{"$nulls":6},"ASHST",0,0,0,25,0,0,0,0,0,{"$f":"'Jan-Abr 2025'!AT11","v":0},{"$f":"'Jan-Abr 2025'!AS11+'Mai-Ago 2025'!AS11+'Set-Dez 2025'!AS11+'Jan-Abr 2026'!AS11+'Mai-Ago 2026'!AS11+'Set-Dez 2026'!AS11+'Jan-Abr 2027'!AS11+'Mai-Ago 2027'!AS11","v":0},{"$nulls":3},0,0,0,null,0,0,0,0,0,{"$f":"'Jan-Abr 2025'!BH11","v":0},{"$f":"'Jan-Abr 2025'!BG11+'Mai-Ago 2025'!BG11+'Set-Dez 2025'!BG11+'Jan-Abr 2026'!BG11+'Mai-Ago 2026'!BG11+'Set-Dez 2026'!BG11+'Jan-Abr 2027'!BG11+'Mai-Ago 2027'!BG11","v":0},{"$nulls":3},0,0,0,null,0,0,0,0,0,{"$f":"'Jan-Abr 2025'!BV11","v":0},{"$f":"'Jan-Abr 2025'!BU11+'Mai-Ago 2025'!BU11+'Set-Dez 2025'!BU11+'Jan-Abr 2026'!BU11+'Mai-Ago 2026'!BU11+'Set-Dez 2026'!BU11+'Jan-Abr 2027'!BU11+'Mai-Ago 2027'!BU11","v":0},{"$nulls":30},{"$f":"TEXT(A8,\"mmm\")","v":"mai"}]
["11h00 - 11h50",{"$nulls":27},"Deus",{"$nulls":6},"DT",0,0,0,25,0,0,0,0,0,{"$f":"'Jan-Abr 2025'!AT12","v":0},{"$f":"'Jan-Abr 2025'!AS12+'Mai-Ago 2025'!AS12+'Set-Dez 2025'!AS12+'Jan-Abr 2026'!AS12+'Mai-Ago 2026'!AS12+'Set-Dez 2026'!AS12+'Jan-Abr 2027'!AS12+'Mai-Ago 2027'!AS12","v":0},{"$nulls":3},0,0,0,null,0,0,0,0,0,{"$f":"'Jan-Abr 2025'!BH12","v":0},{"$f":"'Jan-Abr 2025'!BG12+'Mai-Ago 2025'!BG12+'Set-Dez 2025'!BG12+'Jan-Abr 2026'!BG12+'Mai-Ago 2026'!BG12+'Set-Dez 2026'!BG12+'Jan-Abr 2027'!BG12+'Mai-Ago 2027'!BG12","v":0},{"$nulls":3},0,0,0,null,0,0,0,0,0,{"$f":"'Jan-Abr 2025'!BV12","v":0},{"$f":"'Jan-Abr 2025'!BU12+'Mai-Ago 2025'!BU12+'Set-Dez 2025'!BU12+'Jan-Abr 2026'!BU12+'Mai-Ago 2026'!BU12+'Set-Dez 2026'!BU12+'Jan-Abr 2027'!BU12+'Mai-Ago 2027'!BU12","v":0},{"$nulls":30},{"$f":"TEXT(A20,\"mmm\")","v":"jun"}]
["11h50 - 12h40",{"$nulls":34},"ICS",0,0,0,25,0,0,0,0,0,{"$f":"'Jan-Abr 2025'!AT13","v":0},{"$f":"'Jan-Abr 2025'!AS13+'Mai-Ago 2025'!AS13+'Set-Dez 2025'!AS13+'Jan-Abr 2026'!AS13+'Mai-Ago 2026'!AS13+'Set-Dez 2026'!AS13+'Jan-Abr 2027'!AS13+'Mai-Ago 2027'!AS13","v":0},{"$nulls":3},0,0,0,null,0,0,0,0,0,{"$f":"'Jan-Abr 2025'!BH13","v":0},{"$f":"'Jan-Abr 2025'!BG13+'Mai-Ago 2025'!BG13+'Set-Dez 2025'!BG13+'Jan-Abr 2026'!BG13+'Mai-Ago 2026'!BG13+'Set-Dez 2026'!BG13+'Jan-Abr 2027'!BG13+'Mai-Ago 2027'!BG13","v":0},{"$nulls":3},0,0,0,null,0,0,0,0,0,{"$f":"'Jan-Abr 2025'!BV13","v":0},{"$f":"'Jan-Abr 2025'!BU13+'Mai-Ago 2025'!BU13+'Set-Dez 2025'!BU13+'Jan-Abr 2026'!BU13+'Mai-Ago 2026'!BU13+'Set-Dez 2026'!BU13+'Jan-Abr 2027'!BU13+'Mai-Ago 2027'!BU13","v":0},{"$nulls":30},{"$f":"TEXT(A32,\"mmm\")","v":"jul"}]
[{"$nulls":36},0,0,0,null,0,0,0,0,0,{"$f":"'Jan-Abr 2025'!AT14","v":0},{"$f":"'Jan-Abr 2025'!AS14+'Mai-Ago 2025'!AS14+'Set-Dez 2025'!AS14+'Jan-Abr 2026'!AS14+'Mai-Ago 2026'!AS14+'Set-Dez 2026'!AS14+'Jan-Abr 2027'!AS14+'Mai-Ago 2027'!AS14","v":0},{"$nulls":3},0,0,0,null,0,0,0,0,0,{"$f":"'Jan-Abr 2025'!BH14","v":0},{"$f":"'Jan-Abr 2025'!BG14+'Mai-Ago 2025'!BG14+'Set-Dez 2025'!BG14+'Jan-Abr 2026'!BG14+'Mai-Ago 2026'!BG14+'Set-Dez 2026'!BG14+'Jan-Abr 2027'!BG14+'Mai-Ago 2027'!BG14","v":0},{"$nulls":3},0,0,0,null,0,0,0,0,0,{"$f":"'Jan-Abr 2025'!BV14","v":0},{"$f":"'Jan-Abr 2025'!BU14+'Mai-Ago 2025'!BU14+'Set-Dez 2025'!BU14+'Jan-Abr 2026'!BU14+'Mai-Ago 2026'!BU14+'Set-Dez 2026'!BU14+'Jan-Abr 2027'!BU14+'Mai-Ago 2027'!BU14","v":0},{"$nulls":30},{"$f":"TEXT(A44,\"mmm\")","v":"ago"}]
["14h00 - 14h50",{"$nulls":34},"PFL",0,0,0,25,0,0,0,0,0,{"$f":"'Jan-Abr 2025'!AT15","v":0},{"$f":"'Jan-Abr 2025'!AS15+'Mai-Ago 2025'!AS15+'Set-Dez 2025'!AS15+'Jan-Abr 2026'!AS15+'Mai-Ago 2026'!AS15+'Set-Dez 2026'!AS15+'Jan-Abr 2027'!AS15+'Mai-Ago 2027'!AS15","v":0},{"$nulls":3},0,0,0,null,0,0,0,0,0,{"$f":"'Jan-Abr 2025'!BH15","v":0},{"$f":"'Jan-Abr 2025'!BG15+'Mai-Ago 2025'!BG15+'Set-Dez 2025'!BG15+'Jan-Abr 2026'!BG15+'Mai-Ago 2026'!BG15+'Set-Dez 2026'!BG15+'Jan-Abr 2027'!BG15+'Mai-Ago 2027'!BG15","v":0},{"$nulls":3},0,0,0,null,0,0,0,0,0,{"$f":"'Jan-Abr 2025'!BV15","v":0},{"$f":"'Jan-Abr 2025'!BU15+'Mai-Ago 2025'!BU15+'Set-Dez 2025'!BU15+'Jan-Abr 2026'!BU15+'Mai-Ago 2026'!BU15+'Set-Dez 2026'!BU15+'Jan-Abr 2027'!BU15+'Mai-Ago 2027'!BU15","v":0}]
["14h50 - 15h40",{"$nulls":34},"PCC",0,0,0,25,0,0,0,0,0,{"$f":"'Jan-Abr 2025'!AT16","v":0},{"$f":"'Jan-Abr 2025'!AS16+'Mai-Ago 2025'!AS16+'Set-Dez 2025'!AS16+'Jan-Abr 2026'!AS16+'Mai-Ago 2026'!AS16+'Set-Dez 2026'!AS16+'Jan-Abr 2027'!AS16+'Mai-Ago 2027'!AS16","v":0},{"$nulls":3},0,0,0,null,0,0,0,0,0,{"$f":"'Jan-Abr 2025'!BH16","v":0},{"$f":"'Jan-Abr 2025'!BG16+'Mai-Ago 2025'!BG16+'Set-Dez 2025'!BG16+'Jan-Abr 2026'!BG16+'Mai-Ago 2026'!BG16+'Set-Dez 2026'!BG16+'Jan-Abr 2027'!BG16+'Mai-Ago 2027'!BG16","v":0},{"$nulls":3},0,0,0,null,0,0,0,0,0,{"$f":"'Jan-Abr 2025'!BV16","v":0},{"$f":"'Jan-Abr 2025'!BU16+'Mai-Ago 2025'!BU16+'Set-Dez 2025'!BU16+'Jan-Abr 2026'!BU16+'Mai-Ago 2026'!BU16+'Set-Dez 2026'!BU16+'Jan-Abr 2027'!BU16+'Mai-Ago 2027'!BU16","v":0}]
["16h00 - 16h50",{"$nulls":34},"PAA",0,0,0,25,0,0,0,0,0,{"$f":"'Jan-Abr 2025'!AT17","v":0},{"$f":"'Jan-Abr 2025'!AS17+'Mai-Ago 2025'!AS17+'Set-Dez 2025'!AS17+'Jan-Abr 2026'!AS17+'Mai-Ago 2026'!AS17+'Set-Dez 2026'!AS17+'Jan-Abr 2027'!AS17+'Mai-Ago 2027'!AS17","v":0},{"$nulls":3},0,0,0,null,0,0,0,0,0,{"$f":"'Jan-Abr 2025'!BH17","v":0},{"$f":"'Jan-Abr 2025'!BG17+'Mai-Ago 2025'!BG17+'Set-Dez 2025'!BG17+'Jan-Abr 2026'!BG17+'Mai-Ago 2026'!BG17+'Set-Dez 2026'!BG17+'Jan-Abr 2027'!BG17+'Mai-Ago 2027'!BG17","v":0},{"$nulls":3},0,0,0,null,0,0,0,0,0,{"$f":"'Jan-Abr 2025'!BV17","v":0},{"$f":"'Jan-Abr 2025'!BU17+'Mai-Ago 2025'!BU17+'Set-Dez 2025'!BU17+'Jan-Abr 2026'!BU17+'Mai-Ago 2026'!BU17+'Set-Dez 2026'!BU17+'Jan-Abr 2027'!BU17+'Mai-Ago 2027'!BU17","v":0}]
["16h50 - 17h40",{"$nulls":34},"IME",0,0,0,50,0,0,0,0,0,{"$f":"'Jan-Abr 2025'!AT18","v":0},{"$f":"'Jan-Abr 2025'!AS18+'Mai-Ago 2025'!AS18+'Set-Dez 2025'!AS18+'Jan-Abr 2026'!AS18+'Mai-Ago 2026'!AS18+'Set-Dez 2026'!AS18+'Jan-Abr 2027'!AS18+'Mai-Ago 2027'!AS18","v":0},{"$nulls":3},0,0,0,null,0,0,0,0,0,{"$f":"'Jan-Abr 2025'!BH18","v":0},{"$f":"'Jan-Abr 2025'!BG18+'Mai-Ago 2025'!BG18+'Set-Dez 2025'!BG18+'Jan-Abr 2026'!BG18+'Mai-Ago 2026'!BG18+'Set-Dez 2026'!BG18+'Jan-Abr 2027'!BG18+'Mai-Ago 2027'!BG18","v":0},{"$nulls":3},0,0,0,null,0,0,0,0,0,{"$f":"'Jan-Abr 2025'!BV18","v":0},{"$f":"'Jan-Abr 2025'!BU18+'Mai-Ago 2025'!BU18+'Set-Dez 2025'!BU18+'Jan-Abr 2026'!BU18+'Mai-Ago 2026'!BU18+'Set-Dez 2026'!BU18+'Jan-Abr 2027'!BU18+'Mai-Ago 2027'!BU18","v":0}]
[{"$nulls":35},"ELE",0,0,0,50,0,0,0,0,0,{"$f":"'Jan-Abr 2025'!AT19","v":0},{"$f":"'Jan-Abr 2025'!AS19+'Mai-Ago 2025'!AS19+'Set-Dez 2025'!AS19+'Jan-Abr 2026'!AS19+'Mai-Ago 2026'!AS19+'Set-Dez 2026'!AS19+'Jan-Abr 2027'!AS19+'Mai-Ago 2027'!AS19","v":0},{"$nulls":3},0,0,0,null,0,0,0,0,0,{"$f":"'Jan-Abr 2025'!BH19","v":0},{"$f":"'Jan-Abr 2025'!BG19+'Mai-Ago 2025'!BG19+'Set-Dez 2025'!BG19+'Jan-Abr 2026'!BG19+'Mai-Ago 2026'!BG19+'Set-Dez 2026'!BG19+'Jan-Abr 2027'!BG19+'Mai-Ago 2027'!BG19","v":0},{"$nulls":3},0,0,0,null,0,0,0,0,0,{"$f":"'Jan-Abr 2025'!BV19","v":0},{"$f":"'Jan-Abr 2025'!BU19+'Mai-Ago 2025'!BU19+'Set-Dez 2025'!BU19+'Jan-Abr 2026'!BU19+'Mai-Ago 2026'!BU19+'Set-Dez 2026'!BU19+'Jan-Abr 2027'!BU19+'Mai-Ago 2027'!BU19","v":0}]
[{"$f":"A8+DAY(EOMONTH(A8,0))","v":"2027-06-01"},null,{"$f":"IF(C21<>\"\",CHOOSE(WEEKDAY(C21,1),\"Dom.\",\"Seg.\",\"Ter.\",\"Qua.\",\"Qui.\",\"Sex.\",\"Sáb.\"),\"\")","v":"Ter."},{"$f":"IF(D21<>\"\",CHOOSE(WEEKDAY(D21,1),\"Dom.\",\"Seg.\",\"Ter.\",\"Qua.\",\"Qui.\",\"Sex.\",\"Sáb.\"),\"\")","v":"Qua."},"Qui.","Sex.","Sáb.","Dom.","Seg.","Ter.","Qua.","Qui.","Sex.","Sáb.","Dom.","Seg.","Ter.","Qua.","Qui.","Sex.","Sáb.","Dom.","Seg.","Ter.","Qua.","Qui.","Sex.","Sáb.","Dom.","Seg.","Ter.","Qua.","",null,null,"CP",0,0,0,25,0,0,0,0,0,{"$f":"'Jan-Abr 2025'!AT20","v":0},{"$f":"'Jan-Abr 2025'!AS20+'Mai-Ago 2025'!AS20+'Set-Dez 2025'!AS20+'Jan-Abr 2026'!AS20+'Mai-Ago 2026'!AS20+'Set-Dez 2026'!AS20+'Jan-Abr 2027'!AS20+'Mai-Ago 2027'!AS20","v":0},{"$nulls":3},0,0,0,null,0,0,0,0,0,{"$f":"'Jan-Abr 2025'!BH20","v":0},{"$f":"'Jan-Abr 2025'!BG20+'Mai-Ago 2025'!BG20+'Set-Dez 2025'!BG20+'Jan-Abr 2026'!BG20+'Mai-Ago 2026'!BG20+'Set-Dez 2026'!BG20+'Jan-Abr 2027'!BG20+'Mai-Ago 2027'!BG20","v":0},{"$nulls":3},0,0,0,null,0,0,0,0,0,{"$f":"'Jan-Abr 2025'!BV20","v":0},{"$f":"'Jan-Abr 2025'!BU20+'Mai-Ago 2025'!BU20+'Set-Dez 2025'!BU20+'Jan-Abr 2026'!BU20+'Mai-Ago 2026'!BU20+'Set-Dez 2026'!BU20+'Jan-Abr 2027'!BU20+'Mai-Ago 2027'!BU20","v":0}]
[null,null,{"$f":"A20","v":"2027-06-01"},{"$f":"IF(C21=\"\",\"\",IF(DAY(C21)<DAY(EOMONTH(C21,0)),C21+1,\"\"))","v":"2027-06-02"},"2027-06-03","2027-06-04","2027-06-05","2027-06-06","2027-06-07","2027-06-08","2027-06-09","2027-06-10","2027-06-11","2027-06-12","2027-06-13","2027-06-14","2027-06-15","2027-06-16","2027-06-17","2027-06-18","2027-06-19","2027-06-20","2027-06-21","2027-06-22","2027-06-23","2027-06-24","2027-06-25","2027-06-26","2027-06-27","2027-06-28","2027-06-29","2027-06-30","",null,null,"CH",0,0,0,25,0,0,0,0,0,{"$f":"'Jan-Abr 2025'!AT21","v":0},{"$f":"'Jan-Abr 2025'!AS21+'Mai-Ago 2025'!AS21+'Set-Dez 2025'!AS21+'Jan-Abr 2026'!AS21+'Mai-Ago 2026'!AS21+'Set-Dez 2026'!AS21+'Jan-Abr 2027'!AS21+'Mai-Ago 2027'!AS21","v":0},{"$nulls":3},0,0,0,null,0,0,0,0,0,{"$f":"'Jan-Abr 2025'!BH21","v":0},{"$f":"'Jan-Abr 2025'!BG21+'Mai-Ago 2025'!BG21+'Set-Dez 2025'!BG21+'Jan-Abr 2026'!BG21+'Mai-Ago 2026'!BG21+'Set-Dez 2026'!BG21+'Jan-Abr 2027'!BG21+'Mai-Ago 2027'!BG21","v":0},{"$nulls":3},0,0,0,null,0,0,0,0,0,{"$f":"'Jan-Abr 2025'!BV21","v":0},{"$f":"'Jan-Abr 2025'!BU21+'Mai-Ago 2025'!BU21+'Set-Dez 2025'!BU21+'Jan-Abr 2026'!BU21+'Mai-Ago 2026'!BU21+'Set-Dez 2026'!BU21+'Jan-Abr 2027'!BU21+'Mai-Ago 2027'!BU21","v":0}]
[{"$f":"A10","v":"09h00 - 09h50"},{"$nulls":10},"Dia",{"$nulls":23},"CLP",0,0,0,50,0,0,0,0,0,{"$f":"'Jan-Abr 2025'!AT22","v":0},{"$f":"'Jan-Abr 2025'!AS22+'Mai-Ago 2025'!AS22+'Set-Dez 2025'!AS22+'Jan-Abr 2026'!AS22+'Mai-Ago 2026'!AS22+'Set-Dez 2026'!AS22+'Jan-Abr 2027'!AS22+'Mai-Ago 2027'!AS22","v":0},{"$nulls":3},0,0,0,null,0,0,0,0,0,{"$f":"'Jan-Abr 2025'!BH22","v":0},{"$f":"'Jan-Abr 2025'!BG22+'Mai-Ago 2025'!BG22+'Set-Dez 2025'!BG22+'Jan-Abr 2026'!BG22+'Mai-Ago 2026'!BG22+'Set-Dez 2026'!BG22+'Jan-Abr 2027'!BG22+'Mai-Ago 2027'!BG22","v":0},{"$nulls":3},0,0,0,null,0,0,0,0,0,{"$f":"'Jan-Abr 2025'!BV22","v":0},{"$f":"'Jan-Abr 2025'!BU22+'Mai-Ago 2025'!BU22+'Set-Dez 2025'!BU22+'Jan-Abr 2026'!BU22+'Mai-Ago 2026'!BU22+'Set-Dez 2026'!BU22+'Jan-Abr 2027'!BU22+'Mai-Ago 2027'!BU22","v":0}]
[{"$f":"A11","v":"09h50 - 10h40"},{"$nulls":10},"de",{"$nulls":23},"DCM",0,0,0,50,0,0,0,0,0,{"$f":"'Jan-Abr 2025'!AT23","v":0},{"$f":"'Jan-Abr 2025'!AS23+'Mai-Ago 2025'!AS23+'Set-Dez 2025'!AS23+'Jan-Abr 2026'!AS23+'Mai-Ago 2026'!AS23+'Set-Dez 2026'!AS23+'Jan-Abr 2027'!AS23+'Mai-Ago 2027'!AS23","v":0},{"$nulls":3},0,0,0,null,0,0,0,0,0,{"$f":"'Jan-Abr 2025'!BH23","v":0},{"$f":"'Jan-Abr 2025'!BG23+'Mai-Ago 2025'!BG23+'Set-Dez 2025'!BG23+'Jan-Abr 2026'!BG23+'Mai-Ago 2026'!BG23+'Set-Dez 2026'!BG23+'Jan-Abr 2027'!BG23+'Mai-Ago 2027'!BG23","v":0},{"$nulls":3},0,0,0,null,0,0,0,0,0,{"$f":"'Jan-Abr 2025'!BV23","v":0},{"$f":"'Jan-Abr 2025'!BU23+'Mai-Ago 2025'!BU23+'Set-Dez 2025'!BU23+'Jan-Abr 2026'!BU23+'Mai-Ago 2026'!BU23+'Set-Dez 2026'!BU23+'Jan-Abr 2027'!BU23+'Mai-Ago 2027'!BU23","v":0}]
["11h00 - 11h50",{"$nulls":10},"Port.",{"$nulls":23},"CM",0,0,0,50,0,0,0,0,0,{"$f":"'Jan-Abr 2025'!AT24","v":0},{"$f":"'Jan-Abr 2025'!AS24+'Mai-Ago 2025'!AS24+'Set-Dez 2025'!AS24+'Jan-Abr 2026'!AS24+'Mai-Ago 2026'!AS24+'Set-Dez 2026'!AS24+'Jan-Abr 2027'!AS24+'Mai-Ago 2027'!AS24","v":0},{"$nulls":3},0,0,0,null,0,0,0,0,0,{"$f":"'Jan-Abr 2025'!BH24","v":0},{"$f":"'Jan-Abr 2025'!BG24+'Mai-Ago 2025'!BG24+'Set-Dez 2025'!BG24+'Jan-Abr 2026'!BG24+'Mai-Ago 2026'!BG24+'Set-Dez 2026'!BG24+'Jan-Abr 2027'!BG24+'Mai-Ago 2027'!BG24","v":0},{"$nulls":3},0,0,0,null,0,0,0,0,0,{"$f":"'Jan-Abr 2025'!BV24","v":0},{"$f":"'Jan-Abr 2025'!BU24+'Mai-Ago 2025'!BU24+'Set-Dez 2025'!BU24+'Jan-Abr 2026'!BU24+'Mai-Ago 2026'!BU24+'Set-Dez 2026'!BU24+'Jan-Abr 2027'!BU24+'Mai-Ago 2027'!BU24","v":0}]
["11h50 - 12h40",{"$nulls":34},"SD",0,0,0,50,0,0,0,0,0,{"$f":"'Jan-Abr 2025'!AT25","v":0},{"$f":"'Jan-Abr 2025'!AS25+'Mai-Ago 2025'!AS25+'Set-Dez 2025'!AS25+'Jan-Abr 2026'!AS25+'Mai-Ago 2026'!AS25+'Set-Dez 2026'!AS25+'Jan-Abr 2027'!AS25+'Mai-Ago 2027'!AS25","v":0},{"$nulls":3},0,0,0,null,0,0,0,0,0,{"$f":"'Jan-Abr 2025'!BH25","v":0},{"$f":"'Jan-Abr 2025'!BG25+'Mai-Ago 2025'!BG25+'Set-Dez 2025'!BG25+'Jan-Abr 2026'!BG25+'Mai-Ago 2026'!BG25+'Set-Dez 2026'!BG25+'Jan-Abr 2027'!BG25+'Mai-Ago 2027'!BG25","v":0},{"$nulls":3},0,0,0,null,0,0,0,0,0,{"$f":"'Jan-Abr 2025'!BV25","v":0},{"$f":"'Jan-Abr 2025'!BU25+'Mai-Ago 2025'!BU25+'Set-Dez 2025'!BU25+'Jan-Abr 2026'!BU25+'Mai-Ago 2026'!BU25+'Set-Dez 2026'!BU25+'Jan-Abr 2027'!BU25+'Mai-Ago 2027'!BU25","v":0}]
[{"$nulls":35},"OEM",0,0,0,50,0,0,0,0,0,{"$f":"'Jan-Abr 2025'!AT26","v":0},{"$f":"'Jan-Abr 2025'!AS26+'Mai-Ago 2025'!AS26+'Set-Dez 2025'!AS26+'Jan-Abr 2026'!AS26+'Mai-Ago 2026'!AS26+'Set-Dez 2026'!AS26+'Jan-Abr 2027'!AS26+'Mai-Ago 2027'!AS26","v":0},{"$nulls":3},0,0,0,null,0,0,0,0,0,{"$f":"'Jan-Abr 2025'!BH26","v":0},{"$f":"'Jan-Abr 2025'!BG26+'Mai-Ago 2025'!BG26+'Set-Dez 2025'!BG26+'Jan-Abr 2026'!BG26+'Mai-Ago 2026'!BG26+'Set-Dez 2026'!BG26+'Jan-Abr 2027'!BG26+'Mai-Ago 2027'!BG26","v":0},{"$nulls":3},0,0,0,null,0,0,0,0,0,{"$f":"'Jan-Abr 2025'!BV26","v":0},{"$f":"'Jan-Abr 2025'!BU26+'Mai-Ago 2025'!BU26+'Set-Dez 2025'!BU26+'Jan-Abr 2026'!BU26+'Mai-Ago 2026'!BU26+'Set-Dez 2026'!BU26+'Jan-Abr 2027'!BU26+'Mai-Ago 2027'!BU26","v":0}]
["14h00 - 14h50",{"$nulls":34},"GP",0,0,0,50,0,0,0,0,0,{"$f":"'Jan-Abr 2025'!AT27","v":0},{"$f":"'Jan-Abr 2025'!AS27+'Mai-Ago 2025'!AS27+'Set-Dez 2025'!AS27+'Jan-Abr 2026'!AS27+'Mai-Ago 2026'!AS27+'Set-Dez 2026'!AS27+'Jan-Abr 2027'!AS27+'Mai-Ago 2027'!AS27","v":0},{"$nulls":3},0,0,0,null,0,0,0,0,0,{"$f":"'Jan-Abr 2025'!BH27","v":0},{"$f":"'Jan-Abr 2025'!BG27+'Mai-Ago 2025'!BG27+'Set-Dez 2025'!BG27+'Jan-Abr 2026'!BG27+'Mai-Ago 2026'!BG27+'Set-Dez 2026'!BG27+'Jan-Abr 2027'!BG27+'Mai-Ago 2027'!BG27","v":0},{"$nulls":3},0,0,0,null,0,0,0,0,0,{"$f":"'Jan-Abr 2025'!BV27","v":0},{"$f":"'Jan-Abr 2025'!BU27+'Mai-Ago 2025'!BU27+'Set-Dez 2025'!BU27+'Jan-Abr 2026'!BU27+'Mai-Ago 2026'!BU27+'Set-Dez 2026'!BU27+'Jan-Abr 2027'!BU27+'Mai-Ago 2027'!BU27","v":0}]
["14h50 - 15h40",{"$nulls":34},"PP",0,0,0,50,0,0,0,0,0,{"$f":"'Jan-Abr 2025'!AT28","v":0},{"$f":"'Jan-Abr 2025'!AS28+'Mai-Ago 2025'!AS28+'Set-Dez 2025'!AS28+'Jan-Abr 2026'!AS28+'Mai-Ago 2026'!AS28+'Set-Dez 2026'!AS28+'Jan-Abr 2027'!AS28+'Mai-Ago 2027'!AS28","v":0},{"$nulls":3},0,0,0,null,0,0,0,0,0,{"$f":"'Jan-Abr 2025'!BH28","v":0},{"$f":"'Jan-Abr 2025'!BG28+'Mai-Ago 2025'!BG28+'Set-Dez 2025'!BG28+'Jan-Abr 2026'!BG28+'Mai-Ago 2026'!BG28+'Set-Dez 2026'!BG28+'Jan-Abr 2027'!BG28+'Mai-Ago 2027'!BG28","v":0},{"$nulls":3},0,0,0,null,0,0,0,0,0,{"$f":"'Jan-Abr 2025'!BV28","v":0},{"$f":"'Jan-Abr 2025'!BU28+'Mai-Ago 2025'!BU28+'Set-Dez 2025'!BU28+'Jan-Abr 2026'!BU28+'Mai-Ago 2026'!BU28+'Set-Dez 2026'!BU28+'Jan-Abr 2027'!BU28+'Mai-Ago 2027'!BU28","v":0}]
["16h00 - 16h50",{"$nulls":34},"GS",0,0,0,50,0,0,0,0,0,{"$f":"'Jan-Abr 2025'!AT29","v":0},{"$f":"'Jan-Abr 2025'!AS29+'Mai-Ago 2025'!AS29+'Set-Dez 2025'!AS29+'Jan-Abr 2026'!AS29+'Mai-Ago 2026'!AS29+'Set-Dez 2026'!AS29+'Jan-Abr 2027'!AS29+'Mai-Ago 2027'!AS29","v":0},{"$nulls":3},0,0,0,null,0,0,0,0,0,{"$f":"'Jan-Abr 2025'!BH29","v":0},{"$f":"'Jan-Abr 2025'!BG29+'Mai-Ago 2025'!BG29+'Set-Dez 2025'!BG29+'Jan-Abr 2026'!BG29+'Mai-Ago 2026'!BG29+'Set-Dez 2026'!BG29+'Jan-Abr 2027'!BG29+'Mai-Ago 2027'!BG29","v":0},{"$nulls":3},0,0,0,null,0,0,0,0,0,{"$f":"'Jan-Abr 2025'!BV29","v":0},{"$f":"'Jan-Abr 2025'!BU29+'Mai-Ago 2025'!BU29+'Set-Dez 2025'!BU29+'Jan-Abr 2026'!BU29+'Mai-Ago 2026'!BU29+'Set-Dez 2026'!BU29+'Jan-Abr 2027'!BU29+'Mai-Ago 2027'!BU29","v":0}]
["16h50 - 17h40",{"$nulls":34},"CGO",0,0,0,50,0,0,0,0,0,{"$f":"'Jan-Abr 2025'!AT30","v":0},{"$f":"'Jan-Abr 2025'!AS30+'Mai-Ago 2025'!AS30+'Set-Dez 2025'!AS30+'Jan-Abr 2026'!AS30+'Mai-Ago 2026'!AS30+'Set-Dez 2026'!AS30+'Jan-Abr 2027'!AS30+'Mai-Ago 2027'!AS30","v":0},{"$nulls":3},0,0,0,null,0,0,0,0,0,{"$f":"'Jan-Abr 2025'!BH30","v":0},{"$f":"'Jan-Abr 2025'!BG30+'Mai-Ago 2025'!BG30+'Set-Dez 2025'!BG30+'Jan-Abr 2026'!BG30+'Mai-Ago 2026'!BG30+'Set-Dez 2026'!BG30+'Jan-Abr 2027'!BG30+'Mai-Ago 2027'!BG30","v":0},{"$nulls":3},0,0,0,null,0,0,0,0,0,{"$f":"'Jan-Abr 2025'!BV30","v":0},{"$f":"'Jan-Abr 2025'!BU30+'Mai-Ago 2025'!BU30+'Set-Dez 2025'!BU30+'Jan-Abr 2026'!BU30+'Mai-Ago 2026'!BU30+'Set-Dez 2026'!BU30+'Jan-Abr 2027'!BU30+'Mai-Ago 2027'!BU30","v":0}]
[{"$nulls":35},"LOG",0,0,0,50,0,0,0,0,0,{"$f":"'Jan-Abr 2025'!AT31","v":0},{"$f":"'Jan-Abr 2025'!AS31+'Mai-Ago 2025'!AS31+'Set-Dez 2025'!AS31+'Jan-Abr 2026'!AS31+'Mai-Ago 2026'!AS31+'Set-Dez 2026'!AS31+'Jan-Abr 2027'!AS31+'Mai-Ago 2027'!AS31","v":0},{"$nulls":3},0,0,0,null,0,0,0,0,0,{"$f":"'Jan-Abr 2025'!BH31","v":0},{"$f":"'Jan-Abr 2025'!BG31+'Mai-Ago 2025'!BG31+'Set-Dez 2025'!BG31+'Jan-Abr 2026'!BG31+'Mai-Ago 2026'!BG31+'Set-Dez 2026'!BG31+'Jan-Abr 2027'!BG31+'Mai-Ago 2027'!BG31","v":0},{"$nulls":3},0,0,0,null,0,0,0,0,0,{"$f":"'Jan-Abr 2025'!BV31","v":0},{"$f":"'Jan-Abr 2025'!BU31+'Mai-Ago 2025'!BU31+'Set-Dez 2025'!BU31+'Jan-Abr 2026'!BU31+'Mai-Ago 2026'!BU31+'Set-Dez 2026'!BU31+'Jan-Abr 2027'!BU31+'Mai-Ago 2027'!BU31","v":0}]
[{"$f":"A20+DAY(EOMONTH(A20,0))","v":"2027-07-01"},null,{"$f":"IF(C33<>\"\",CHOOSE(WEEKDAY(C33,1),\"Dom.\",\"Seg.\",\"Ter.\",\"Qua.\",\"Qui.\",\"Sex.\",\"Sáb.\"),\"\")","v":"Qui."},{"$f":"IF(D33<>\"\",CHOOSE(WEEKDAY(D33,1),\"Dom.\",\"Seg.\",\"Ter.\",\"Qua.\",\"Qui.\",\"Sex.\",\"Sáb.\"),\"\")","v":"Sex."},"Sáb.","Dom.","Seg.","Ter.","Qua.","Qui.","Sex.","Sáb.","Dom.","Seg.","Ter.","Qua.","Qui.","Sex.","Sáb.","Dom.","Seg.","Ter.","Qua.","Qui.","Sex.","Sáb.","Dom.","Seg.","Ter.","Qua.","Qui.","Sex.","Sáb.",null,null,"MOT",0,0,0,50,0,0,0,0,0,{"$f":"'Jan-Abr 2025'!AT32","v":0},{"$f":"'Jan-Abr 2025'!AS32+'Mai-Ago 2025'!AS32+'Set-Dez 2025'!AS32+'Jan-Abr 2026'!AS32+'Mai-Ago 2026'!AS32+'Set-Dez 2026'!AS32+'Jan-Abr 2027'!AS32+'Mai-Ago 2027'!AS32","v":0},{"$nulls":3},0,0,0,null,0,0,0,0,0,{"$f":"'Jan-Abr 2025'!BH32","v":0},{"$f":"'Jan-Abr 2025'!BG32+'Mai-Ago 2025'!BG32+'Set-Dez 2025'!BG32+'Jan-Abr 2026'!BG32+'Mai-Ago 2026'!BG32+'Set-Dez 2026'!BG32+'Jan-Abr 2027'!BG32+'Mai-Ago 2027'!BG32","v":0},{"$nulls":3},0,0,0,null,0,0,0,0,0,{"$f":"'Jan-Abr 2025'!BV32","v":0},{"$f":"'Jan-Abr 2025'!BU32+'Mai-Ago 2025'!BU32+'Set-Dez 2025'!BU32+'Jan-Abr 2026'!BU32+'Mai-Ago 2026'!BU32+'Set-Dez 2026'!BU32+'Jan-Abr 2027'!BU32+'Mai-Ago 2027'!BU32","v":0}]
[null,null,{"$f":"A32","v":"2027-07-01"},{"$f":"IF(C33=\"\",\"\",IF(DAY(C33)<DAY(EOMONTH(C33,0)),C33+1,\"\"))","v":"2027-07-02"},"2027-07-03","2027-07-04","2027-07-05","2027-07-06","2027-07-07","2027-07-08","2027-07-09","2027-07-10","2027-07-11","2027-07-12","2027-07-13","2027-07-14","2027-07-15","2027-07-16","2027-07-17","2027-07-18","2027-07-19","2027-07-20","2027-07-21","2027-07-22","2027-07-23","2027-07-24","2027-07-25","2027-07-26","2027-07-27","2027-07-28","2027-07-29","2027-07-30","2027-07-31",null,null,"SGI",0,0,0,25,0,0,0,0,0,{"$f":"'Jan-Abr 2025'!AT33","v":0},{"$f":"'Jan-Abr 2025'!AS33+'Mai-Ago 2025'!AS33+'Set-Dez 2025'!AS33+'Jan-Abr 2026'!AS33+'Mai-Ago 2026'!AS33+'Set-Dez 2026'!AS33+'Jan-Abr 2027'!AS33+'Mai-Ago 2027'!AS33","v":0},{"$nulls":3},0,0,0,null,0,0,0,0,0,{"$f":"'Jan-Abr 2025'!BH33","v":0},{"$f":"'Jan-Abr 2025'!BG33+'Mai-Ago 2025'!BG33+'Set-Dez 2025'!BG33+'Jan-Abr 2026'!BG33+'Mai-Ago 2026'!BG33+'Set-Dez 2026'!BG33+'Jan-Abr 2027'!BG33+'Mai-Ago 2027'!BG33","v":0},{"$nulls":3},0,0,0,null,0,0,0,0,0,{"$f":"'Jan-Abr 2025'!BV33","v":0},{"$f":"'Jan-Abr 2025'!BU33+'Mai-Ago 2025'!BU33+'Set-Dez 2025'!BU33+'Jan-Abr 2026'!BU33+'Mai-Ago 2026'!BU33+'Set-Dez 2026'!BU33+'Jan-Abr 2027'!BU33+'Mai-Ago 2027'!BU33","v":0}]
[{"$f":"A22","v":"09h00 - 09h50"},{"$nulls":34},"QCEP",0,0,0,50,0,0,0,0,0,{"$f":"'Jan-Abr 2025'!AT34","v":0},{"$f":"'Jan-Abr 2025'!AS34+'Mai-Ago 2025'!AS34+'Set-Dez 2025'!AS34+'Jan-Abr 2026'!AS34+'Mai-Ago 2026'!AS34+'Set-Dez 2026'!AS34+'Jan-Abr 2027'!AS34+'Mai-Ago 2027'!AS34","v":0},{"$nulls":3},0,0,0,null,0,0,0,0,0,{"$f":"'Jan-Abr 2025'!BH34","v":0},{"$f":"'Jan-Abr 2025'!BG34+'Mai-Ago 2025'!BG34+'Set-Dez 2025'!BG34+'Jan-Abr 2026'!BG34+'Mai-Ago 2026'!BG34+'Set-Dez 2026'!BG34+'Jan-Abr 2027'!BG34+'Mai-Ago 2027'!BG34","v":0},{"$nulls":3},0,0,0,null,0,0,0,0,0,{"$f":"'Jan-Abr 2025'!BV34","v":0},{"$f":"'Jan-Abr 2025'!BU34+'Mai-Ago 2025'!BU34+'Set-Dez 2025'!BU34+'Jan-Abr 2026'!BU34+'Mai-Ago 2026'!BU34+'Set-Dez 2026'!BU34+'Jan-Abr 2027'!BU34+'Mai-Ago 2027'!BU34","v":0}]
[{"$f":"A23","v":"09h50 - 10h40"},{"$nulls":35},0,0,0,null,0,0,0,0,0,{"$f":"'Jan-Abr 2025'!AT35","v":0},{"$f":"'Jan-Abr 2025'!AS35+'Mai-Ago 2025'!AS35+'Set-Dez 2025'!AS35+'Jan-Abr 2026'!AS35+'Mai-Ago 2026'!AS35+'Set-Dez 2026'!AS35+'Jan-Abr 2027'!AS35+'Mai-Ago 2027'!AS35","v":0},{"$nulls":3},0,0,0,null,0,0,0,0,0,{"$f":"'Jan-Abr 2025'!BH35","v":0},{"$f":"'Jan-Abr 2025'!BG35+'Mai-Ago 2025'!BG35+'Set-Dez 2025'!BG35+'Jan-Abr 2026'!BG35+'Mai-Ago 2026'!BG35+'Set-Dez 2026'!BG35+'Jan-Abr 2027'!BG35+'Mai-Ago 2027'!BG35","v":0},{"$nulls":3},0,0,0,null,0,0,0,0,0,{"$f":"'Jan-Abr 2025'!BV35","v":0},{"$f":"'Jan-Abr 2025'!BU35+'Mai-Ago 2025'!BU35+'Set-Dez 2025'!BU35+'Jan-Abr 2026'!BU35+'Mai-Ago 2026'!BU35+'Set-Dez 2026'!BU35+'Jan-Abr 2027'!BU35+'Mai-Ago 2027'!BU35","v":0}]
["11h00 - 11h50",{"$nulls":35},0,0,0,null,0,0,0,0,0,{"$f":"'Jan-Abr 2025'!AT36","v":0},{"$f":"'Jan-Abr 2025'!AS36+'Mai-Ago 2025'!AS36+'Set-Dez 2025'!AS36+'Jan-Abr 2026'!AS36+'Mai-Ago 2026'!AS36+'Set-Dez 2026'!AS36+'Jan-Abr 2027'!AS36+'Mai-Ago 2027'!AS36","v":0},{"$nulls":3},0,0,0,null,0,0,0,0,0,{"$f":"'Jan-Abr 2025'!BH36","v":0},{"$f":"'Jan-Abr 2025'!BG36+'Mai-Ago 2025'!BG36+'Set-Dez 2025'!BG36+'Jan-Abr 2026'!BG36+'Mai-Ago 2026'!BG36+'Set-Dez 2026'!BG36+'Jan-Abr 2027'!BG36+'Mai-Ago 2027'!BG36","v":0},{"$nulls":3},0,0,0,null,0,0,0,0,0,{"$f":"'Jan-Abr 2025'!BV36","v":0},{"$f":"'Jan-Abr 2025'!BU36+'Mai-Ago 2025'!BU36+'Set-Dez 2025'!BU36+'Jan-Abr 2026'!BU36+'Mai-Ago 2026'!BU36+'Set-Dez 2026'!BU36+'Jan-Abr 2027'!BU36+'Mai-Ago 2027'!BU36","v":0}]
["11h50 - 12h40",{"$nulls":35},0,0,0,null,0,0,0,0,0,{"$f":"'Jan-Abr 2025'!AT37","v":0},{"$f":"'Jan-Abr 2025'!AS37+'Mai-Ago 2025'!AS37+'Set-Dez 2025'!AS37+'Jan-Abr 2026'!AS37+'Mai-Ago 2026'!AS37+'Set-Dez 2026'!AS37+'Jan-Abr 2027'!AS37+'Mai-Ago 2027'!AS37","v":0},{"$nulls":3},0,0,0,null,0,0,0,0,0,{"$f":"'Jan-Abr 2025'!BH37","v":0},{"$f":"'Jan-Abr 2025'!BG37+'Mai-Ago 2025'!BG37+'Set-Dez 2025'!BG37+'Jan-Abr 2026'!BG37+'Mai-Ago 2026'!BG37+'Set-Dez 2026'!BG37+'Jan-Abr 2027'!BG37+'Mai-Ago 2027'!BG37","v":0},{"$nulls":3},0,0,0,null,0,0,0,0,0,{"$f":"'Jan-Abr 2025'!BV37","v":0},{"$f":"'Jan-Abr 2025'!BU37+'Mai-Ago 2025'!BU37+'Set-Dez 2025'!BU37+'Jan-Abr 2026'!BU37+'Mai-Ago 2026'!BU37+'Set-Dez 2026'!BU37+'Jan-Abr 2027'!BU37+'Mai-Ago 2027'!BU37","v":0}]
[{"$nulls":36},0,0,0,null,0,0,0,0,0,{"$f":"'Jan-Abr 2025'!AT38","v":0},{"$f":"'Jan-Abr 2025'!AS38+'Mai-Ago 2025'!AS38+'Set-Dez 2025'!AS38+'Jan-Abr 2026'!AS38+'Mai-Ago 2026'!AS38+'Set-Dez 2026'!AS38+'Jan-Abr 2027'!AS38+'Mai-Ago 2027'!AS38","v":0},{"$nulls":3},0,0,0,null,0,0,0,0,0,{"$f":"'Jan-Abr 2025'!BH38","v":0},{"$f":"'Jan-Abr 2025'!BG38+'Mai-Ago 2025'!BG38+'Set-Dez 2025'!BG38+'Jan-Abr 2026'!BG38+'Mai-Ago 2026'!BG38+'Set-Dez 2026'!BG38+'Jan-Abr 2027'!BG38+'Mai-Ago 2027'!BG38","v":0},{"$nulls":3},0,0,0,null,0,0,0,0,0,{"$f":"'Jan-Abr 2025'!BV38","v":0},{"$f":"'Jan-Abr 2025'!BU38+'Mai-Ago 2025'!BU38+'Set-Dez 2025'!BU38+'Jan-Abr 2026'!BU38+'Mai-Ago 2026'!BU38+'Set-Dez 2026'!BU38+'Jan-Abr 2027'!BU38+'Mai-Ago 2027'!BU38","v":0}]
["14h00 - 14h50",{"$nulls":35},0,0,0,null,0,0,0,0,0,{"$f":"'Jan-Abr 2025'!AT39","v":0},{"$f":"'Jan-Abr 2025'!AS39+'Mai-Ago 2025'!AS39+'Set-Dez 2025'!AS39+'Jan-Abr 2026'!AS39+'Mai-Ago 2026'!AS39+'Set-Dez 2026'!AS39+'Jan-Abr 2027'!AS39+'Mai-Ago 2027'!AS39","v":0},{"$nulls":3},0,0,0,null,0,0,0,0,0,{"$f":"'Jan-Abr 2025'!BH39","v":0},{"$f":"'Jan-Abr 2025'!BG39+'Mai-Ago 2025'!BG39+'Set-Dez 2025'!BG39+'Jan-Abr 2026'!BG39+'Mai-Ago 2026'!BG39+'Set-Dez 2026'!BG39+'Jan-Abr 2027'!BG39+'Mai-Ago 2027'!BG39","v":0},{"$nulls":3},0,0,0,null,0,0,0,0,0,{"$f":"'Jan-Abr 2025'!BV39","v":0},{"$f":"'Jan-Abr 2025'!BU39+'Mai-Ago 2025'!BU39+'Set-Dez 2025'!BU39+'Jan-Abr 2026'!BU39+'Mai-Ago 2026'!BU39+'Set-Dez 2026'!BU39+'Jan-Abr 2027'!BU39+'Mai-Ago 2027'!BU39","v":0}]
["14h50 - 15h40",{"$nulls":35},0,0,0,null,0,0,0,0,{"$f":"SUM(AO40:AR40)","v":0},{"$f":"'Jan-Abr 2025'!AT40","v":0},{"$f":"'Jan-Abr 2025'!AS40+'Mai-Ago 2025'!AS40+'Set-Dez 2025'!AS40+'Jan-Abr 2026'!AS40+'Mai-Ago 2026'!AS40+'Set-Dez 2026'!AS40+'Jan-Abr 2027'!AS40+'Mai-Ago 2027'!AS40","v":0},{"$nulls":3},0,0,0,null,0,0,0,0,0,{"$f":"'Jan-Abr 2025'!BH40","v":0},{"$f":"'Jan-Abr 2025'!BG40+'Mai-Ago 2025'!BG40+'Set-Dez 2025'!BG40+'Jan-Abr 2026'!BG40+'Mai-Ago 2026'!BG40+'Set-Dez 2026'!BG40+'Jan-Abr 2027'!BG40+'Mai-Ago 2027'!BG40","v":0},{"$nulls":3},0,0,0,null,0,0,0,0,{"$f":"SUM(BQ40:BT40)","v":0},{"$f":"'Jan-Abr 2025'!BV40","v":0},{"$f":"'Jan-Abr 2025'!BU40+'Mai-Ago 2025'!BU40+'Set-Dez 2025'!BU40+'Jan-Abr 2026'!BU40+'Mai-Ago 2026'!BU40+'Set-Dez 2026'!BU40+'Jan-Abr 2027'!BU40+'Mai-Ago 2027'!BU40","v":0}]
["16h00 - 16h50",{"$nulls":35},0,0,0,null,0,0,0,0,0,{"$f":"'Jan-Abr 2025'!AT41","v":0},{"$f":"'Jan-Abr 2025'!AS41+'Mai-Ago 2025'!AS41+'Set-Dez 2025'!AS41+'Jan-Abr 2026'!AS41+'Mai-Ago 2026'!AS41+'Set-Dez 2026'!AS41+'Jan-Abr 2027'!AS41+'Mai-Ago 2027'!AS41","v":0},{"$nulls":3},0,0,0,null,0,0,0,0,0,{"$f":"'Jan-Abr 2025'!BH41","v":0},{"$f":"'Jan-Abr 2025'!BG41+'Mai-Ago 2025'!BG41+'Set-Dez 2025'!BG41+'Jan-Abr 2026'!BG41+'Mai-Ago 2026'!BG41+'Set-Dez 2026'!BG41+'Jan-Abr 2027'!BG41+'Mai-Ago 2027'!BG41","v":0},{"$nulls":3},0,0,0,null,0,0,0,0,0,{"$f":"'Jan-Abr 2025'!BV41","v":0},{"$f":"'Jan-Abr 2025'!BU41+'Mai-Ago 2025'!BU41+'Set-Dez 2025'!BU41+'Jan-Abr 2026'!BU41+'Mai-Ago 2026'!BU41+'Set-Dez 2026'!BU41+'Jan-Abr 2027'!BU41+'Mai-Ago 2027'!BU41","v":0}]
["16h50 - 17h40",{"$nulls":35},0,0,0,null,0,0,0,0,0,{"$f":"'Jan-Abr 2025'!AT42","v":0},{"$f":"'Jan-Abr 2025'!AS42+'Mai-Ago 2025'!AS42+'Set-Dez 2025'!AS42+'Jan-Abr 2026'!AS42+'Mai-Ago 2026'!AS42+'Set-Dez 2026'!AS42+'Jan-Abr 2027'!AS42+'Mai-Ago 2027'!AS42","v":0},{"$nulls":3},0,0,0,null,0,0,0,0,0,{"$f":"'Jan-Abr 2025'!BH42","v":0},{"$f":"'Jan-Abr 2025'!BG42+'Mai-Ago 2025'!BG42+'Set-Dez 2025'!BG42+'Jan-Abr 2026'!BG42+'Mai-Ago 2026'!BG42+'Set-Dez 2026'!BG42+'Jan-Abr 2027'!BG42+'Mai-Ago 2027'!BG42","v":0},{"$nulls":3},0,0,0,null,0,0,0,0,0,{"$f":"'Jan-Abr 2025'!BV42","v":0},{"$f":"'Jan-Abr 2025'!BU42+'Mai-Ago 2025'!BU42+'Set-Dez 2025'!BU42+'Jan-Abr 2026'!BU42+'Mai-Ago 2026'!BU42+'Set-Dez 2026'!BU42+'Jan-Abr 2027'!BU42+'Mai-Ago 2027'!BU42","v":0}]
[{"$nulls":36},0,0,0,null,0,0,0,0,0,{"$f":"'Jan-Abr 2025'!AT43","v":0},{"$f":"'Jan-Abr 2025'!AS43+'Mai-Ago 2025'!AS43+'Set-Dez 2025'!AS43+'Jan-Abr 2026'!AS43+'Mai-Ago 2026'!AS43+'Set-Dez 2026'!AS43+'Jan-Abr 2027'!AS43+'Mai-Ago 2027'!AS43","v":0},{"$nulls":3},0,0,0,null,0,0,0,0,0,{"$f":"'Jan-Abr 2025'!BH43","v":0},{"$f":"'Jan-Abr 2025'!BG43+'Mai-Ago 2025'!BG43+'Set-Dez 2025'!BG43+'Jan-Abr 2026'!BG43+'Mai-Ago 2026'!BG43+'Set-Dez 2026'!BG43+'Jan-Abr 2027'!BG43+'Mai-Ago 2027'!BG43","v":0},{"$nulls":3},0,0,0,null,0,0,0,0,0,{"$f":"'Jan-Abr 2025'!BV43","v":0},{"$f":"'Jan-Abr 2025'!BU43+'Mai-Ago 2025'!BU43+'Set-Dez 2025'!BU43+'Jan-Abr 2026'!BU43+'Mai-Ago 2026'!BU43+'Set-Dez 2026'!BU43+'Jan-Abr 2027'!BU43+'Mai-Ago 2027'!BU43","v":0}]
[{"$f":"A32+DAY(EOMONTH(A32,0))","v":"2027-08-01"},null,{"$f":"IF(C45<>\"\",CHOOSE(WEEKDAY(C45,1),\"Dom.\",\"Seg.\",\"Ter.\",\"Qua.\",\"Qui.\",\"Sex.\",\"Sáb.\"),\"\")","v":"Dom."},{"$f":"IF(D45<>\"\",CHOOSE(WEEKDAY(D45,1),\"Dom.\",\"Seg.\",\"Ter.\",\"Qua.\",\"Qui.\",\"Sex.\",\"Sáb.\"),\"\")","v":"Seg."},"Ter.","Qua.","Qui.","Sex.","Sáb.","Dom.","Seg.","Ter.","Qua.","Qui.","Sex.","Sáb.","Dom.","Seg.","Ter.","Qua.","Qui.","Sex.","Sáb.","Dom.","Seg.","Ter.","Qua.","Qui.","Sex.","Sáb.","Dom.","Seg.","Ter.",{"$nulls":3},0,0,0,null,0,0,0,0,0,{"$f":"'Jan-Abr 2025'!AT44","v":0},{"$f":"'Jan-Abr 2025'!AS44+'Mai-Ago 2025'!AS44+'Set-Dez 2025'!AS44+'Jan-Abr 2026'!AS44+'Mai-Ago 2026'!AS44+'Set-Dez 2026'!AS44+'Jan-Abr 2027'!AS44+'Mai-Ago 2027'!AS44","v":0},{"$nulls":3},0,0,0,null,0,0,0,0,0,{"$f":"'Jan-Abr 2025'!BH44","v":0},{"$f":"'Jan-Abr 2025'!BG44+'Mai-Ago 2025'!BG44+'Set-Dez 2025'!BG44+'Jan-Abr 2026'!BG44+'Mai-Ago 2026'!BG44+'Set-Dez 2026'!BG44+'Jan-Abr 2027'!BG44+'Mai-Ago 2027'!BG44","v":0},{"$nulls":3},0,0,0,null,0,0,0,0,0,{"$f":"'Jan-Abr 2025'!BV44","v":0},{"$f":"'Jan-Abr 2025'!BU44+'Mai-Ago 2025'!BU44+'Set-Dez 2025'!BU44+'Jan-Abr 2026'!BU44+'Mai-Ago 2026'!BU44+'Set-Dez 2026'!BU44+'Jan-Abr 2027'!BU44+'Mai-Ago 2027'!BU44","v":0}]
[null,null,{"$f":"A44","v":"2027-08-01"},{"$f":"IF(C45=\"\",\"\",IF(DAY(C45)<DAY(EOMONTH(C45,0)),C45+1,\"\"))","v":"2027-08-02"},"2027-08-03","2027-08-04","2027-08-05","2027-08-06","2027-08-07","2027-08-08","2027-08-09","2027-08-10","2027-08-11","2027-08-12","2027-08-13","2027-08-14","2027-08-15","2027-08-16","2027-08-17","2027-08-18","2027-08-19","2027-08-20","2027-08-21","2027-08-22","2027-08-23","2027-08-24","2027-08-25","2027-08-26","2027-08-27","2027-08-28","2027-08-29","2027-08-30","2027-08-31",{"$nulls":3},0,0,0,null,0,0,0,0,0,{"$f":"'Jan-Abr 2025'!AT45","v":0},{"$f":"'Jan-Abr 2025'!AS45+'Mai-Ago 2025'!AS45+'Set-Dez 2025'!AS45+'Jan-Abr 2026'!AS45+'Mai-Ago 2026'!AS45+'Set-Dez 2026'!AS45+'Jan-Abr 2027'!AS45+'Mai-Ago 2027'!AS45","v":0},{"$nulls":3},0,0,0,null,0,0,0,0,0,{"$f":"'Jan-Abr 2025'!BH45","v":0},{"$f":"'Jan-Abr 2025'!BG45+'Mai-Ago 2025'!BG45+'Set-Dez 2025'!BG45+'Jan-Abr 2026'!BG45+'Mai-Ago 2026'!BG45+'Set-Dez 2026'!BG45+'Jan-Abr 2027'!BG45+'Mai-Ago 2027'!BG45","v":0},{"$nulls":3},0,0,0,null,0,0,0,0,0,{"$f":"'Jan-Abr 2025'!BV45","v":0},{"$f":"'Jan-Abr 2025'!BU45+'Mai-Ago 2025'!BU45+'Set-Dez 2025'!BU45+'Jan-Abr 2026'!BU45+'Mai-Ago 2026'!BU45+'Set-Dez 2026'!BU45+'Jan-Abr 2027'!BU45+'Mai-Ago 2027'!BU45","v":0}]
[{"$f":"A10","v":"09h00 - 09h50"},{"$nulls":15},"Assunção",{"$nulls":19},0,0,0,null,0,0,0,0,0,{"$f":"'Jan-Abr 2025'!AT46","v":0},{"$f":"'Jan-Abr 2025'!AS46+'Mai-Ago 2025'!AS46+'Set-Dez 2025'!AS46+'Jan-Abr 2026'!AS46+'Mai-Ago 2026'!AS46+'Set-Dez 2026'!AS46+'Jan-Abr 2027'!AS46+'Mai-Ago 2027'!AS46","v":0},{"$nulls":3},0,0,0,null,0,0,0,0,0,{"$f":"'Jan-Abr 2025'!BH46","v":0},{"$f":"'Jan-Abr 2025'!BG46+'Mai-Ago 2025'!BG46+'Set-Dez 2025'!BG46+'Jan-Abr 2026'!BG46+'Mai-Ago 2026'!BG46+'Set-Dez 2026'!BG46+'Jan-Abr 2027'!BG46+'Mai-Ago 2027'!BG46","v":0},{"$nulls":3},0,0,0,null,0,0,0,0,0,{"$f":"'Jan-Abr 2025'!BV46","v":0},{"$f":"'Jan-Abr 2025'!BU46+'Mai-Ago 2025'!BU46+'Set-Dez 2025'!BU46+'Jan-Abr 2026'!BU46+'Mai-Ago 2026'!BU46+'Set-Dez 2026'!BU46+'Jan-Abr 2027'!BU46+'Mai-Ago 2027'!BU46","v":0}]
[{"$f":"A11","v":"09h50 - 10h40"},{"$nulls":15},"Nossa",{"$nulls":19},0,0,0,null,0,0,0,0,0,{"$f":"'Jan-Abr 2025'!AT47","v":0},{"$f":"'Jan-Abr 2025'!AS47+'Mai-Ago 2025'!AS47+'Set-Dez 2025'!AS47+'Jan-Abr 2026'!AS47+'Mai-Ago 2026'!AS47+'Set-Dez 2026'!AS47+'Jan-Abr 2027'!AS47+'Mai-Ago 2027'!AS47","v":0},{"$nulls":3},0,0,0,null,0,0,0,0,0,{"$f":"'Jan-Abr 2025'!BH47","v":0},{"$f":"'Jan-Abr 2025'!BG47+'Mai-Ago 2025'!BG47+'Set-Dez 2025'!BG47+'Jan-Abr 2026'!BG47+'Mai-Ago 2026'!BG47+'Set-Dez 2026'!BG47+'Jan-Abr 2027'!BG47+'Mai-Ago 2027'!BG47","v":0},{"$nulls":3},0,0,0,null,0,0,0,0,0,{"$f":"'Jan-Abr 2025'!BV47","v":0},{"$f":"'Jan-Abr 2025'!BU47+'Mai-Ago 2025'!BU47+'Set-Dez 2025'!BU47+'Jan-Abr 2026'!BU47+'Mai-Ago 2026'!BU47+'Set-Dez 2026'!BU47+'Jan-Abr 2027'!BU47+'Mai-Ago 2027'!BU47","v":0}]
["11h00 - 11h50",{"$nulls":15},"Senhora",{"$nulls":19},0,0,0,null,0,0,0,0,0,{"$f":"'Jan-Abr 2025'!AT48","v":0},{"$f":"'Jan-Abr 2025'!AS48+'Mai-Ago 2025'!AS48+'Set-Dez 2025'!AS48+'Jan-Abr 2026'!AS48+'Mai-Ago 2026'!AS48+'Set-Dez 2026'!AS48+'Jan-Abr 2027'!AS48+'Mai-Ago 2027'!AS48","v":0},{"$nulls":3},0,0,0,null,0,0,0,0,0,{"$f":"'Jan-Abr 2025'!BH48","v":0},{"$f":"'Jan-Abr 2025'!BG48+'Mai-Ago 2025'!BG48+'Set-Dez 2025'!BG48+'Jan-Abr 2026'!BG48+'Mai-Ago 2026'!BG48+'Set-Dez 2026'!BG48+'Jan-Abr 2027'!BG48+'Mai-Ago 2027'!BG48","v":0},{"$nulls":3},0,0,0,null,0,0,0,0,0,{"$f":"'Jan-Abr 2025'!BV48","v":0},{"$f":"'Jan-Abr 2025'!BU48+'Mai-Ago 2025'!BU48+'Set-Dez 2025'!BU48+'Jan-Abr 2026'!BU48+'Mai-Ago 2026'!BU48+'Set-Dez 2026'!BU48+'Jan-Abr 2027'!BU48+'Mai-Ago 2027'!BU48","v":0}]
["11h50 - 12h40",{"$nulls":35},0,0,0,null,0,0,0,0,0,{"$f":"'Jan-Abr 2025'!AT49","v":0},{"$f":"'Jan-Abr 2025'!AS49+'Mai-Ago 2025'!AS49+'Set-Dez 2025'!AS49+'Jan-Abr 2026'!AS49+'Mai-Ago 2026'!AS49+'Set-Dez 2026'!AS49+'Jan-Abr 2027'!AS49+'Mai-Ago 2027'!AS49","v":0},{"$nulls":3},0,0,0,null,0,0,0,0,0,{"$f":"'Jan-Abr 2025'!BH49","v":0},{"$f":"'Jan-Abr 2025'!BG49+'Mai-Ago 2025'!BG49+'Set-Dez 2025'!BG49+'Jan-Abr 2026'!BG49+'Mai-Ago 2026'!BG49+'Set-Dez 2026'!BG49+'Jan-Abr 2027'!BG49+'Mai-Ago 2027'!BG49","v":0},{"$nulls":3},0,0,0,null,0,0,0,0,0,{"$f":"'Jan-Abr 2025'!BV49","v":0},{"$f":"'Jan-Abr 2025'!BU49+'Mai-Ago 2025'!BU49+'Set-Dez 2025'!BU49+'Jan-Abr 2026'!BU49+'Mai-Ago 2026'!BU49+'Set-Dez 2026'!BU49+'Jan-Abr 2027'!BU49+'Mai-Ago 2027'!BU49","v":0}]
[{"$nulls":36},0,0,0,null,0,0,0,0,0,{"$f":"'Jan-Abr 2025'!AT50","v":0},{"$f":"'Jan-Abr 2025'!AS50+'Mai-Ago 2025'!AS50+'Set-Dez 2025'!AS50+'Jan-Abr 2026'!AS50+'Mai-Ago 2026'!AS50+'Set-Dez 2026'!AS50+'Jan-Abr 2027'!AS50+'Mai-Ago 2027'!AS50","v":0},{"$nulls":3},0,0,0,null,0,0,0,0,0,{"$f":"'Jan-Abr 2025'!BH50","v":0},{"$f":"'Jan-Abr 2025'!BG50+'Mai-Ago 2025'!BG50+'Set-Dez 2025'!BG50+'Jan-Abr 2026'!BG50+'Mai-Ago 2026'!BG50+'Set-Dez 2026'!BG50+'Jan-Abr 2027'!BG50+'Mai-Ago 2027'!BG50","v":0},{"$nulls":3},0,0,0,null,0,0,0,0,0,{"$f":"'Jan-Abr 2025'!BV50","v":0},{"$f":"'Jan-Abr 2025'!BU50+'Mai-Ago 2025'!BU50+'Set-Dez 2025'!BU50+'Jan-Abr 2026'!BU50+'Mai-Ago 2026'!BU50+'Set-Dez 2026'!BU50+'Jan-Abr 2027'!BU50+'Mai-Ago 2027'!BU50","v":0}]
["14h00 - 14h50",{"$nulls":35},0,0,0,null,0,0,0,0,0,{"$f":"'Jan-Abr 2025'!AT51","v":0},{"$f":"'Jan-Abr 2025'!AS51+'Mai-Ago 2025'!AS51+'Set-Dez 2025'!AS51+'Jan-Abr 2026'!AS51+'Mai-Ago 2026'!AS51+'Set-Dez 2026'!AS51+'Jan-Abr 2027'!AS51+'Mai-Ago 2027'!AS51","v":0},{"$nulls":3},0,0,0,null,0,0,0,0,0,{"$f":"'Jan-Abr 2025'!BH51","v":0},{"$f":"'Jan-Abr 2025'!BG51+'Mai-Ago 2025'!BG51+'Set-Dez 2025'!BG51+'Jan-Abr 2026'!BG51+'Mai-Ago 2026'!BG51+'Set-Dez 2026'!BG51+'Jan-Abr 2027'!BG51+'Mai-Ago 2027'!BG51","v":0},{"$nulls":3},0,0,0,null,0,0,0,0,0,{"$f":"'Jan-Abr 2025'!BV51","v":0},{"$f":"'Jan-Abr 2025'!BU51+'Mai-Ago 2025'!BU51+'Set-Dez 2025'!BU51+'Jan-Abr 2026'!BU51+'Mai-Ago 2026'!BU51+'Set-Dez 2026'!BU51+'Jan-Abr 2027'!BU51+'Mai-Ago 2027'!BU51","v":0}]
["14h50 - 15h40",{"$nulls":35},0,0,0,null,0,0,0,0,0,{"$f":"'Jan-Abr 2025'!AT52","v":0},{"$f":"'Jan-Abr 2025'!AS52+'Mai-Ago 2025'!AS52+'Set-Dez 2025'!AS52+'Jan-Abr 2026'!AS52+'Mai-Ago 2026'!AS52+'Set-Dez 2026'!AS52+'Jan-Abr 2027'!AS52+'Mai-Ago 2027'!AS52","v":0},{"$nulls":3},0,0,0,null,0,0,0,0,0,{"$f":"'Jan-Abr 2025'!BH52","v":0},{"$f":"'Jan-Abr 2025'!BG52+'Mai-Ago 2025'!BG52+'Set-Dez 2025'!BG52+'Jan-Abr 2026'!BG52+'Mai-Ago 2026'!BG52+'Set-Dez 2026'!BG52+'Jan-Abr 2027'!BG52+'Mai-Ago 2027'!BG52","v":0},{"$nulls":3},0,0,0,null,0,0,0,0,0,{"$f":"'Jan-Abr 2025'!BV52","v":0},{"$f":"'Jan-Abr 2025'!BU52+'Mai-Ago 2025'!BU52+'Set-Dez 2025'!BU52+'Jan-Abr 2026'!BU52+'Mai-Ago 2026'!BU52+'Set-Dez 2026'!BU52+'Jan-Abr 2027'!BU52+'Mai-Ago 2027'!BU52","v":0}]
["16h00 - 16h50",{"$nulls":35},0,0,0,null,0,0,0,0,0,{"$f":"'Jan-Abr 2025'!AT53","v":0},{"$f":"'Jan-Abr 2025'!AS53+'Mai-Ago 2025'!AS53+'Set-Dez 2025'!AS53+'Jan-Abr 2026'!AS53+'Mai-Ago 2026'!AS53+'Set-Dez 2026'!AS53+'Jan-Abr 2027'!AS53+'Mai-Ago 2027'!AS53","v":0},{"$nulls":3},0,0,0,null,0,0,0,0,0,{"$f":"'Jan-Abr 2025'!BH53","v":0},{"$f":"'Jan-Abr 2025'!BG53+'Mai-Ago 2025'!BG53+'Set-Dez 2025'!BG53+'Jan-Abr 2026'!BG53+'Mai-Ago 2026'!BG53+'Set-Dez 2026'!BG53+'Jan-Abr 2027'!BG53+'Mai-Ago 2027'!BG53","v":0},{"$nulls":3},0,0,0,null,0,0,0,0,0,{"$f":"'Jan-Abr 2025'!BV53","v":0},{"$f":"'Jan-Abr 2025'!BU53+'Mai-Ago 2025'!BU53+'Set-Dez 2025'!BU53+'Jan-Abr 2026'!BU53+'Mai-Ago 2026'!BU53+'Set-Dez 2026'!BU53+'Jan-Abr 2027'!BU53+'Mai-Ago 2027'!BU53","v":0}]
["16h50 - 17h40",{"$nulls":35},0,0,0,null,0,0,0,0,0,{"$f":"'Jan-Abr 2025'!AT54","v":0},{"$f":"'Jan-Abr 2025'!AS54+'Mai-Ago 2025'!AS54+'Set-Dez 2025'!AS54+'Jan-Abr 2026'!AS54+'Mai-Ago 2026'!AS54+'Set-Dez 2026'!AS54+'Jan-Abr 2027'!AS54+'Mai-Ago 2027'!AS54","v":0},{"$nulls":3},0,0,0,null,0,0,0,0,0,{"$f":"'Jan-Abr 2025'!BH54","v":0},{"$f":"'Jan-Abr 2025'!BG54+'Mai-Ago 2025'!BG54+'Set-Dez 2025'!BG54+'Jan-Abr 2026'!BG54+'Mai-Ago 2026'!BG54+'Set-Dez 2026'!BG54+'Jan-Abr 2027'!BG54+'Mai-Ago 2027'!BG54","v":0},{"$nulls":3},0,0,0,null,0,0,0,0,0,{"$f":"'Jan-Abr 2025'!BV54","v":0},{"$f":"'Jan-Abr 2025'!BU54+'Mai-Ago 2025'!BU54+'Set-Dez 2025'!BU54+'Jan-Abr 2026'!BU54+'Mai-Ago 2026'!BU54+'Set-Dez 2026'!BU54+'Jan-Abr 2027'!BU54+'Mai-Ago 2027'!BU54","v":0}]
[{"$nulls":32},"Fim",null,null,"PCT",0,0,0,560,0,0,0,0,0,{"$f":"'Jan-Abr 2025'!AT55","v":0},{"$f":"'Jan-Abr 2025'!AS55+'Mai-Ago 2025'!AS55+'Set-Dez 2025'!AS55+'Jan-Abr 2026'!AS55+'Mai-Ago 2026'!AS55+'Set-Dez 2026'!AS55+'Jan-Abr 2027'!AS55+'Mai-Ago 2027'!AS55","v":0},{"$nulls":3},0,0,0,null,0,0,0,0,0,{"$f":"'Jan-Abr 2025'!BH55","v":0},{"$f":"'Jan-Abr 2025'!BG55+'Mai-Ago 2025'!BG55+'Set-Dez 2025'!BG55+'Jan-Abr 2026'!BG55+'Mai-Ago 2026'!BG55+'Set-Dez 2026'!BG55+'Jan-Abr 2027'!BG55+'Mai-Ago 2027'!BG55","v":0},{"$nulls":3},0,0,0,null,0,0,0,0,0,{"$f":"'Jan-Abr 2025'!BV55","v":0},{"$f":"'Jan-Abr 2025'!BU55+'Mai-Ago 2025'!BU55+'Set-Dez 2025'!BU55+'Jan-Abr 2026'!BU55+'Mai-Ago 2026'!BU55+'Set-Dez 2026'!BU55+'Jan-Abr 2027'!BU55+'Mai-Ago 2027'!BU55","v":0}]
["Sociocultural",5146,"IGO","Introdução à Gestão das Organizações",{"$nulls":5},"B153",25,{"$nulls":7},6418,"OEM","Órgãos e Elementos de Máquinas",{"$nulls":5},"C591",50,{"$nulls":8},0,0,0,null,0,0,0,0,0,{"$f":"'Jan-Abr 2025'!AT56","v":0},{"$f":"'Jan-Abr 2025'!AS56+'Mai-Ago 2025'!AS56+'Set-Dez 2025'!AS56+'Jan-Abr 2026'!AS56+'Mai-Ago 2026'!AS56+'Set-Dez 2026'!AS56+'Jan-Abr 2027'!AS56+'Mai-Ago 2027'!AS56","v":0},{"$nulls":3},0,0,0,null,0,0,0,0,0,{"$f":"'Jan-Abr 2025'!BH56","v":0},{"$f":"'Jan-Abr 2025'!BG56+'Mai-Ago 2025'!BG56+'Set-Dez 2025'!BG56+'Jan-Abr 2026'!BG56+'Mai-Ago 2026'!BG56+'Set-Dez 2026'!BG56+'Jan-Abr 2027'!BG56+'Mai-Ago 2027'!BG56","v":0},{"$nulls":3},0,0,0,null,0,0,0,0,0,{"$f":"'Jan-Abr 2025'!BV56","v":0},{"$f":"'Jan-Abr 2025'!BU56+'Mai-Ago 2025'!BU56+'Set-Dez 2025'!BU56+'Jan-Abr 2026'!BU56+'Mai-Ago 2026'!BU56+'Set-Dez 2026'!BU56+'Jan-Abr 2027'!BU56+'Mai-Ago 2027'!BU56","v":0}]
[null,5152,"GMQ","Gestão e Motivação para a Qualidade",{"$nulls":5},"B155",25,{"$nulls":7},"6442","GP","Gestão de Projetos",{"$nulls":6},50,{"$nulls":8},0,0,0,null,0,0,0,0,0,{"$f":"'Jan-Abr 2025'!AT57","v":0},{"$f":"'Jan-Abr 2025'!AS57+'Mai-Ago 2025'!AS57+'Set-Dez 2025'!AS57+'Jan-Abr 2026'!AS57+'Mai-Ago 2026'!AS57+'Set-Dez 2026'!AS57+'Jan-Abr 2027'!AS57+'Mai-Ago 2027'!AS57","v":0},{"$nulls":3},0,0,0,null,0,0,0,0,0,{"$f":"'Jan-Abr 2025'!BH57","v":0},{"$f":"'Jan-Abr 2025'!BG57+'Mai-Ago 2025'!BG57+'Set-Dez 2025'!BG57+'Jan-Abr 2026'!BG57+'Mai-Ago 2026'!BG57+'Set-Dez 2026'!BG57+'Jan-Abr 2027'!BG57+'Mai-Ago 2027'!BG57","v":0},{"$nulls":3},0,0,0,null,0,0,0,0,0,{"$f":"'Jan-Abr 2025'!BV57","v":0},{"$f":"'Jan-Abr 2025'!BU57+'Mai-Ago 2025'!BU57+'Set-Dez 2025'!BU57+'Jan-Abr 2026'!BU57+'Mai-Ago 2026'!BU57+'Set-Dez 2026'!BU57+'Jan-Abr 2027'!BU57+'Mai-Ago 2027'!BU57","v":0}]
[null,5149,"SGQ","Sistama de Gestão da Qualidade ISO 9001",{"$nulls":5},"F369",25,{"$nulls":7},"6443","PP","Planeamento da Produção",{"$nulls":6},50,{"$nulls":8},0,0,0,null,0,0,0,0,0,{"$f":"'Jan-Abr 2025'!AT58","v":0},{"$f":"'Jan-Abr 2025'!AS58+'Mai-Ago 2025'!AS58+'Set-Dez 2025'!AS58+'Jan-Abr 2026'!AS58+'Mai-Ago 2026'!AS58+'Set-Dez 2026'!AS58+'Jan-Abr 2027'!AS58+'Mai-Ago 2027'!AS58","v":0},{"$nulls":3},0,0,0,null,0,0,0,0,0,{"$f":"'Jan-Abr 2025'!BH58","v":0},{"$f":"'Jan-Abr 2025'!BG58+'Mai-Ago 2025'!BG58+'Set-Dez 2025'!BG58+'Jan-Abr 2026'!BG58+'Mai-Ago 2026'!BG58+'Set-Dez 2026'!BG58+'Jan-Abr 2027'!BG58+'Mai-Ago 2027'!BG58","v":0},{"$nulls":3},0,0,0,null,0,0,0,0,0,{"$f":"'Jan-Abr 2025'!BV58","v":0},{"$f":"'Jan-Abr 2025'!BU58+'Mai-Ago 2025'!BU58+'Set-Dez 2025'!BU58+'Jan-Abr 2026'!BU58+'Mai-Ago 2026'!BU58+'Set-Dez 2026'!BU58+'Jan-Abr 2027'!BU58+'Mai-Ago 2027'!BU58","v":0}]
[null,349,"ASHST","Ambiente, Segurança, Higiene e Saúde no Trabalho",{"$nulls":5},"F423",25,{"$nulls":7},"6444","GS","Gestão de Stocks - Metodologias",{"$nulls":6},50,{"$nulls":8},0,0,0,null,0,0,0,0,0,{"$f":"'Jan-Abr 2025'!AT59","v":0},{"$f":"'Jan-Abr 2025'!AS59+'Mai-Ago 2025'!AS59+'Set-Dez 2025'!AS59+'Jan-Abr 2026'!AS59+'Mai-Ago 2026'!AS59+'Set-Dez 2026'!AS59+'Jan-Abr 2027'!AS59+'Mai-Ago 2027'!AS59","v":0},{"$nulls":3},0,0,0,null,0,0,0,0,0,{"$f":"'Jan-Abr 2025'!BH59","v":0},{"$f":"'Jan-Abr 2025'!BG59+'Mai-Ago 2025'!BG59+'Set-Dez 2025'!BG59+'Jan-Abr 2026'!BG59+'Mai-Ago 2026'!BG59+'Set-Dez 2026'!BG59+'Jan-Abr 2027'!BG59+'Mai-Ago 2027'!BG59","v":0},{"$nulls":3},0,0,0,null,0,0,0,0,0,{"$f":"'Jan-Abr 2025'!BV59","v":0},{"$f":"'Jan-Abr 2025'!BU59+'Mai-Ago 2025'!BU59+'Set-Dez 2025'!BU59+'Jan-Abr 2026'!BU59+'Mai-Ago 2026'!BU59+'Set-Dez 2026'!BU59+'Jan-Abr 2027'!BU59+'Mai-Ago 2027'!BU59","v":0}]
[null,5653,"DT","Direito do Trabalho",{"$nulls":5},"B154",25,{"$nulls":7},"1054","CGO","Custeio e Gestão Orçamental",{"$nulls":6},50,{"$nulls":8},0,0,0,null,0,0,0,0,0,{"$f":"'Jan-Abr 2025'!AT60","v":0},{"$f":"'Jan-Abr 2025'!AS60+'Mai-Ago 2025'!AS60+'Set-Dez 2025'!AS60+'Jan-Abr 2026'!AS60+'Mai-Ago 2026'!AS60+'Set-Dez 2026'!AS60+'Jan-Abr 2027'!AS60+'Mai-Ago 2027'!AS60","v":0},{"$nulls":3},0,0,0,null,0,0,0,0,0,{"$f":"'Jan-Abr 2025'!BH60","v":0},{"$f":"'Jan-Abr 2025'!BG60+'Mai-Ago 2025'!BG60+'Set-Dez 2025'!BG60+'Jan-Abr 2026'!BG60+'Mai-Ago 2026'!BG60+'Set-Dez 2026'!BG60+'Jan-Abr 2027'!BG60+'Mai-Ago 2027'!BG60","v":0},{"$nulls":3},0,0,0,null,0,0,0,0,0,{"$f":"'Jan-Abr 2025'!BV60","v":0},{"$f":"'Jan-Abr 2025'!BU60+'Mai-Ago 2025'!BU60+'Set-Dez 2025'!BU60+'Jan-Abr 2026'!BU60+'Mai-Ago 2026'!BU60+'Set-Dez 2026'!BU60+'Jan-Abr 2027'!BU60+'Mai-Ago 2027'!BU60","v":0}]
[null,5768,"ICS","Inglês em Contexto Socioprofissional",{"$nulls":5},"L046",25,{"$nulls":7},"6445","LOG","Logistica ",{"$nulls":6},50,{"$nulls":8},0,0,0,null,0,0,0,0,0,{"$f":"'Jan-Abr 2025'!AT61","v":0},{"$f":"'Jan-Abr 2025'!AS61+'Mai-Ago 2025'!AS61+'Set-Dez 2025'!AS61+'Jan-Abr 2026'!AS61+'Mai-Ago 2026'!AS61+'Set-Dez 2026'!AS61+'Jan-Abr 2027'!AS61+'Mai-Ago 2027'!AS61","v":0},{"$nulls":3},0,0,0,null,0,0,0,0,0,{"$f":"'Jan-Abr 2025'!BH61","v":0},{"$f":"'Jan-Abr 2025'!BG61+'Mai-Ago 2025'!BG61+'Set-Dez 2025'!BG61+'Jan-Abr 2026'!BG61+'Mai-Ago 2026'!BG61+'Set-Dez 2026'!BG61+'Jan-Abr 2027'!BG61+'Mai-Ago 2027'!BG61","v":0},{"$nulls":3},0,0,0,null,0,0,0,0,0,{"$f":"'Jan-Abr 2025'!BV61","v":0},{"$f":"'Jan-Abr 2025'!BU61+'Mai-Ago 2025'!BU61+'Set-Dez 2025'!BU61+'Jan-Abr 2026'!BU61+'Mai-Ago 2026'!BU61+'Set-Dez 2026'!BU61+'Jan-Abr 2027'!BU61+'Mai-Ago 2027'!BU61","v":0}]
[{"$nulls":18},"6446","MOT","Métodos e Organização do Trabalho",{"$nulls":6},50,{"$nulls":8},0,0,0,null,0,0,0,0,0,{"$f":"'Jan-Abr 2025'!AT62","v":0},{"$f":"'Jan-Abr 2025'!AS62+'Mai-Ago 2025'!AS62+'Set-Dez 2025'!AS62+'Jan-Abr 2026'!AS62+'Mai-Ago 2026'!AS62+'Set-Dez 2026'!AS62+'Jan-Abr 2027'!AS62+'Mai-Ago 2027'!AS62","v":0},{"$nulls":3},0,0,0,null,0,0,0,0,0,{"$f":"'Jan-Abr 2025'!BH62","v":0},{"$f":"'Jan-Abr 2025'!BG62+'Mai-Ago 2025'!BG62+'Set-Dez 2025'!BG62+'Jan-Abr 2026'!BG62+'Mai-Ago 2026'!BG62+'Set-Dez 2026'!BG62+'Jan-Abr 2027'!BG62+'Mai-Ago 2027'!BG62","v":0},{"$nulls":3},0,0,0,null,0,0,0,0,0,{"$f":"'Jan-Abr 2025'!BV62","v":0},{"$f":"'Jan-Abr 2025'!BU62+'Mai-Ago 2025'!BU62+'Set-Dez 2025'!BU62+'Jan-Abr 2026'!BU62+'Mai-Ago 2026'!BU62+'Set-Dez 2026'!BU62+'Jan-Abr 2027'!BU62+'Mai-Ago 2027'!BU62","v":0}]
[{"$nulls":18},"6447","SGI","Sistema de Gestão Integrada",{"$nulls":6},25,{"$nulls":8},0,0,0,null,0,0,0,0,0,{"$f":"'Jan-Abr 2025'!AT63","v":0},{"$f":"'Jan-Abr 2025'!AS63+'Mai-Ago 2025'!AS63+'Set-Dez 2025'!AS63+'Jan-Abr 2026'!AS63+'Mai-Ago 2026'!AS63+'Set-Dez 2026'!AS63+'Jan-Abr 2027'!AS63+'Mai-Ago 2027'!AS63","v":0},{"$nulls":3},0,0,0,null,{"$f":"COUNTIF($C$10:$AG$18,$AX63)","v":0},{"$f":"COUNTIF($C$22:$AG$30,$AX63)","v":0},{"$f":"COUNTIF($C$34:$AG$42,$AX63)","v":0},{"$f":"COUNTIF($C$46:$AG$54,$AX63)","v":0},0,{"$f":"'Jan-Abr 2025'!BH63","v":0},{"$f":"'Jan-Abr 2025'!BG63+'Mai-Ago 2025'!BG63+'Set-Dez 2025'!BG63+'Jan-Abr 2026'!BG63+'Mai-Ago 2026'!BG63+'Set-Dez 2026'!BG63+'Jan-Abr 2027'!BG63+'Mai-Ago 2027'!BG63","v":0},{"$nulls":3},0,0,0,null,0,0,0,0,0,{"$f":"'Jan-Abr 2025'!BV63","v":0},{"$f":"'Jan-Abr 2025'!BU63+'Mai-Ago 2025'!BU63+'Set-Dez 2025'!BU63+'Jan-Abr 2026'!BU63+'Mai-Ago 2026'!BU63+'Set-Dez 2026'!BU63+'Jan-Abr 2027'!BU63+'Mai-Ago 2027'!BU63","v":0}]
["Tecnológica",6407,"PFL","Processos de Fundição / Ligação",{"$nulls":5},"D333",25,{"$nulls":7},"6448","QCEP","Qualidade - controlo estatístico de processo",{"$nulls":6},50,{"$nulls":8},0,0,0,null,0,0,0,0,0,{"$f":"'Jan-Abr 2025'!AT64","v":0},{"$f":"'Jan-Abr 2025'!AS64+'Mai-Ago 2025'!AS64+'Set-Dez 2025'!AS64+'Jan-Abr 2026'!AS64+'Mai-Ago 2026'!AS64+'Set-Dez 2026'!AS64+'Jan-Abr 2027'!AS64+'Mai-Ago 2027'!AS64","v":0},{"$nulls":3},0,0,0,null,0,0,0,0,0,{"$f":"'Jan-Abr 2025'!BH64","v":0},{"$f":"'Jan-Abr 2025'!BG64+'Mai-Ago 2025'!BG64+'Set-Dez 2025'!BG64+'Jan-Abr 2026'!BG64+'Mai-Ago 2026'!BG64+'Set-Dez 2026'!BG64+'Jan-Abr 2027'!BG64+'Mai-Ago 2027'!BG64","v":0},{"$nulls":3},0,0,0,null,0,0,0,0,0,{"$f":"'Jan-Abr 2025'!BV64","v":0},{"$f":"'Jan-Abr 2025'!BU64+'Mai-Ago 2025'!BU64+'Set-Dez 2025'!BU64+'Jan-Abr 2026'!BU64+'Mai-Ago 2026'!BU64+'Set-Dez 2026'!BU64+'Jan-Abr 2027'!BU64+'Mai-Ago 2027'!BU64","v":0}]
[null,6408,"PCC","Processos de Conformação / Corte",{"$nulls":5},"D334",25,{"$nulls":25},0,0,0,null,0,0,0,0,0,{"$f":"'Jan-Abr 2025'!AT65","v":0},{"$f":"'Jan-Abr 2025'!AS65+'Mai-Ago 2025'!AS65+'Set-Dez 2025'!AS65+'Jan-Abr 2026'!AS65+'Mai-Ago 2026'!AS65+'Set-Dez 2026'!AS65+'Jan-Abr 2027'!AS65+'Mai-Ago 2027'!AS65","v":0},{"$nulls":3},0,0,0,null,0,0,0,0,0,{"$f":"'Jan-Abr 2025'!BH65","v":0},{"$f":"'Jan-Abr 2025'!BG65+'Mai-Ago 2025'!BG65+'Set-Dez 2025'!BG65+'Jan-Abr 2026'!BG65+'Mai-Ago 2026'!BG65+'Set-Dez 2026'!BG65+'Jan-Abr 2027'!BG65+'Mai-Ago 2027'!BG65","v":0},{"$nulls":3},0,0,0,null,0,0,0,{"$f":"COUNTIF($C$46:$AG$54,$BL65)","v":0},0,{"$f":"'Jan-Abr 2025'!BV65","v":0},{"$f":"'Jan-Abr 2025'!BU65+'Mai-Ago 2025'!BU65+'Set-Dez 2025'!BU65+'Jan-Abr 2026'!BU65+'Mai-Ago 2026'!BU65+'Set-Dez 2026'!BU65+'Jan-Abr 2027'!BU65+'Mai-Ago 2027'!BU65","v":0}]
[null,6409,"PAA","Processos por Arranque de Apara",{"$nulls":5},"C588",25,{"$nulls":25},0,0,0,null,0,0,0,0,0,{"$f":"'Jan-Abr 2025'!AT66","v":0},{"$f":"'Jan-Abr 2025'!AS66+'Mai-Ago 2025'!AS66+'Set-Dez 2025'!AS66+'Jan-Abr 2026'!AS66+'Mai-Ago 2026'!AS66+'Set-Dez 2026'!AS66+'Jan-Abr 2027'!AS66+'Mai-Ago 2027'!AS66","v":0},{"$nulls":3},0,0,0,null,0,0,0,0,0,{"$f":"'Jan-Abr 2025'!BH66","v":0},{"$f":"'Jan-Abr 2025'!BG66+'Mai-Ago 2025'!BG66+'Set-Dez 2025'!BG66+'Jan-Abr 2026'!BG66+'Mai-Ago 2026'!BG66+'Set-Dez 2026'!BG66+'Jan-Abr 2027'!BG66+'Mai-Ago 2027'!BG66","v":0},{"$nulls":3},0,0,0,null,0,0,0,0,0,{"$f":"'Jan-Abr 2025'!BV66","v":0},{"$f":"'Jan-Abr 2025'!BU66+'Mai-Ago 2025'!BU66+'Set-Dez 2025'!BU66+'Jan-Abr 2026'!BU66+'Mai-Ago 2026'!BU66+'Set-Dez 2026'!BU66+'Jan-Abr 2027'!BU66+'Mai-Ago 2027'!BU66","v":0}]
[null,6410,"IME","Instalação de Máquinas Elétricas",{"$nulls":5},"K252",50,{"$nulls":25},0,0,0,null,0,0,0,0,0,{"$f":"'Jan-Abr 2025'!AT67","v":0},{"$f":"'Jan-Abr 2025'!AS67+'Mai-Ago 2025'!AS67+'Set-Dez 2025'!AS67+'Jan-Abr 2026'!AS67+'Mai-Ago 2026'!AS67+'Set-Dez 2026'!AS67+'Jan-Abr 2027'!AS67+'Mai-Ago 2027'!AS67","v":0},{"$nulls":3},0,0,0,null,0,0,0,0,0,{"$f":"'Jan-Abr 2025'!BH67","v":0},{"$f":"'Jan-Abr 2025'!BG67+'Mai-Ago 2025'!BG67+'Set-Dez 2025'!BG67+'Jan-Abr 2026'!BG67+'Mai-Ago 2026'!BG67+'Set-Dez 2026'!BG67+'Jan-Abr 2027'!BG67+'Mai-Ago 2027'!BG67","v":0},{"$nulls":3},0,0,0,null,0,0,0,0,0,{"$f":"'Jan-Abr 2025'!BV67","v":0},{"$f":"'Jan-Abr 2025'!BU67+'Mai-Ago 2025'!BU67+'Set-Dez 2025'!BU67+'Jan-Abr 2026'!BU67+'Mai-Ago 2026'!BU67+'Set-Dez 2026'!BU67+'Jan-Abr 2027'!BU67+'Mai-Ago 2027'!BU67","v":0}]
[null,6411,"ELE","Eletrónica",{"$nulls":5},"K253",50,{"$nulls":25},0,0,0,null,0,0,0,0,0,{"$f":"'Jan-Abr 2025'!AT68","v":0},{"$f":"'Jan-Abr 2025'!AS68+'Mai-Ago 2025'!AS68+'Set-Dez 2025'!AS68+'Jan-Abr 2026'!AS68+'Mai-Ago 2026'!AS68+'Set-Dez 2026'!AS68+'Jan-Abr 2027'!AS68+'Mai-Ago 2027'!AS68","v":0},{"$nulls":3},0,0,0,null,0,0,0,0,0,{"$f":"'Jan-Abr 2025'!BH68","v":0},{"$f":"'Jan-Abr 2025'!BG68+'Mai-Ago 2025'!BG68+'Set-Dez 2025'!BG68+'Jan-Abr 2026'!BG68+'Mai-Ago 2026'!BG68+'Set-Dez 2026'!BG68+'Jan-Abr 2027'!BG68+'Mai-Ago 2027'!BG68","v":0},{"$nulls":3},0,0,0,null,0,0,0,0,0,{"$f":"'Jan-Abr 2025'!BV68","v":0},{"$f":"'Jan-Abr 2025'!BU68+'Mai-Ago 2025'!BU68+'Set-Dez 2025'!BU68+'Jan-Abr 2026'!BU68+'Mai-Ago 2026'!BU68+'Set-Dez 2026'!BU68+'Jan-Abr 2027'!BU68+'Mai-Ago 2027'!BU68","v":0}]
[null,6412,"CP","Circuitos Pneumáticos",{"$nulls":5},"E329",25,{"$nulls":25},0,0,0,null,0,0,0,0,0,{"$f":"'Jan-Abr 2025'!AT69","v":0},{"$f":"'Jan-Abr 2025'!AS69+'Mai-Ago 2025'!AS69+'Set-Dez 2025'!AS69+'Jan-Abr 2026'!AS69+'Mai-Ago 2026'!AS69+'Set-Dez 2026'!AS69+'Jan-Abr 2027'!AS69+'Mai-Ago 2027'!AS69","v":0},{"$nulls":3},0,0,0,null,0,0,0,0,0,{"$f":"'Jan-Abr 2025'!BH69","v":0},{"$f":"'Jan-Abr 2025'!BG69+'Mai-Ago 2025'!BG69+'Set-Dez 2025'!BG69+'Jan-Abr 2026'!BG69+'Mai-Ago 2026'!BG69+'Set-Dez 2026'!BG69+'Jan-Abr 2027'!BG69+'Mai-Ago 2027'!BG69","v":0},{"$nulls":3},0,0,0,null,0,0,0,0,0,{"$f":"'Jan-Abr 2025'!BV69","v":0},{"$f":"'Jan-Abr 2025'!BU69+'Mai-Ago 2025'!BU69+'Set-Dez 2025'!BU69+'Jan-Abr 2026'!BU69+'Mai-Ago 2026'!BU69+'Set-Dez 2026'!BU69+'Jan-Abr 2027'!BU69+'Mai-Ago 2027'!BU69","v":0}]
[null,6413,"CH","Circuitos Óleo-Hidráulicos",{"$nulls":5},"E330",25,{"$nulls":6},"Estágio",null,"PCT","Prática em Contexto Trabalho",{"$nulls":5},"E368",560,{"$nulls":8},0,0,0,null,0,0,0,0,0,{"$f":"'Jan-Abr 2025'!AT70","v":0},{"$f":"'Jan-Abr 2025'!AS70+'Mai-Ago 2025'!AS70+'Set-Dez 2025'!AS70+'Jan-Abr 2026'!AS70+'Mai-Ago 2026'!AS70+'Set-Dez 2026'!AS70+'Jan-Abr 2027'!AS70+'Mai-Ago 2027'!AS70","v":0},{"$nulls":3},0,0,0,null,0,0,0,0,0,{"$f":"'Jan-Abr 2025'!BH70","v":0},{"$f":"'Jan-Abr 2025'!BG70+'Mai-Ago 2025'!BG70+'Set-Dez 2025'!BG70+'Jan-Abr 2026'!BG70+'Mai-Ago 2026'!BG70+'Set-Dez 2026'!BG70+'Jan-Abr 2027'!BG70+'Mai-Ago 2027'!BG70","v":0},{"$nulls":3},0,0,0,null,0,0,0,0,0,{"$f":"'Jan-Abr 2025'!BV70","v":0},{"$f":"'Jan-Abr 2025'!BU70+'Mai-Ago 2025'!BU70+'Set-Dez 2025'!BU70+'Jan-Abr 2026'!BU70+'Mai-Ago 2026'!BU70+'Set-Dez 2026'!BU70+'Jan-Abr 2027'!BU70+'Mai-Ago 2027'!BU70","v":0}]
[null,6414,"CLP","Controladores Lógicos Programáveis",{"$nulls":5},"C589",50,{"$nulls":25},0,0,0,null,0,0,0,0,0,{"$f":"'Jan-Abr 2025'!AT71","v":0},{"$f":"'Jan-Abr 2025'!AS71+'Mai-Ago 2025'!AS71+'Set-Dez 2025'!AS71+'Jan-Abr 2026'!AS71+'Mai-Ago 2026'!AS71+'Set-Dez 2026'!AS71+'Jan-Abr 2027'!AS71+'Mai-Ago 2027'!AS71","v":0},{"$nulls":3},0,0,0,null,0,0,0,0,0,{"$f":"'Jan-Abr 2025'!BH71","v":0},{"$f":"'Jan-Abr 2025'!BG71+'Mai-Ago 2025'!BG71+'Set-Dez 2025'!BG71+'Jan-Abr 2026'!BG71+'Mai-Ago 2026'!BG71+'Set-Dez 2026'!BG71+'Jan-Abr 2027'!BG71+'Mai-Ago 2027'!BG71","v":0},{"$nulls":3},0,0,0,null,0,0,0,0,0,{"$f":"'Jan-Abr 2025'!BV71","v":0},{"$f":"'Jan-Abr 2025'!BU71+'Mai-Ago 2025'!BU71+'Set-Dez 2025'!BU71+'Jan-Abr 2026'!BU71+'Mai-Ago 2026'!BU71+'Set-Dez 2026'!BU71+'Jan-Abr 2027'!BU71+'Mai-Ago 2027'!BU71","v":0}]
[null,6415,"DCM","Desenho de Construções Mecânicas",{"$nulls":5},"A438",50,{"$nulls":25},{"$f":"IF(AI72=$DC$8,AM72,IF(AI72=$DC$9,AM72,IF(AI72=$DC$10,AL72,)))","v":0},0,{"$f":"IF(AI72=$DC$8,AL72,IF(AI72=$DC$9,AM73+AL72,IF(AI72=$DC$10,IF(AI73=$DC$10,AM73+AL72,AL72),)))","v":0},null,0,0,0,0,{"$f":"SUM(AO72:AR72)","v":0},{"$f":"'Jan-Abr 2025'!AT72","v":0},{"$f":"'Jan-Abr 2025'!AS72+'Mai-Ago 2025'!AS72+'Set-Dez 2025'!AS72+'Jan-Abr 2026'!AS72+'Mai-Ago 2026'!AS72+'Set-Dez 2026'!AS72+'Jan-Abr 2027'!AS72+'Mai-Ago 2027'!AS72","v":0},{"$nulls":3},{"$f":"IF(AW72=$DC$8,BA72,IF(AW72=$DC$9,BA72,IF(AW72=$DC$10,AZ72,)))","v":0},0,{"$f":"IF(AW72=$DC$8,AZ72,IF(AW72=$DC$9,BA73+AZ72,IF(AW72=$DC$10,IF(AW73=$DC$10,BA73+AZ72,AZ72),)))","v":0},null,0,0,0,0,0,{"$f":"'Jan-Abr 2025'!BH72","v":0},{"$f":"'Jan-Abr 2025'!BG72+'Mai-Ago 2025'!BG72+'Set-Dez 2025'!BG72+'Jan-Abr 2026'!BG72+'Mai-Ago 2026'!BG72+'Set-Dez 2026'!BG72+'Jan-Abr 2027'!BG72+'Mai-Ago 2027'!BG72","v":0},{"$nulls":3},{"$f":"IF(BK72=$DC$8,BO72,IF(BK72=$DC$9,BO72,IF(BK72=$DC$10,BN72,)))","v":0},0,{"$f":"IF(BK72=$DC$8,BN72,IF(BK72=$DC$9,BO73+BN72,IF(BK72=$DC$10,IF(BK73=$DC$10,BO73+BN72,BN72),)))","v":0},null,0,0,0,0,{"$f":"SUM(BQ72:BT72)","v":0},{"$f":"'Jan-Abr 2025'!BV72","v":0},{"$f":"'Jan-Abr 2025'!BU72+'Mai-Ago 2025'!BU72+'Set-Dez 2025'!BU72+'Jan-Abr 2026'!BU72+'Mai-Ago 2026'!BU72+'Set-Dez 2026'!BU72+'Jan-Abr 2027'!BU72+'Mai-Ago 2027'!BU72","v":0}]
[null,6416,"CM","Ciência dos Materiais",{"$nulls":5},"C590",50,{"$nulls":25},0,{"$f":"IF($AK$4=$DB$8,AS73,IF($AK$4=$DB$9,AT73,IF($AK$4=$DB$10,AU73,IF($AK$4=$DB$11,AO73,IF($AK$4=$DB$12,AP73,IF($AK$4=$DB$13,AQ73,IF($AK$4=$DB$14,AR73,\"\")))))))","v":0},0,null,{"$f":"COUNTIF($C$10:$AG$18,$AJ73)","v":0},{"$f":"COUNTIF($C$22:$AG$30,$AJ73)","v":0},{"$f":"COUNTIF($C$34:$AG$42,$AJ73)","v":0},{"$f":"COUNTIF($C$46:$AG$54,$AJ73)","v":0},0,{"$f":"'Jan-Abr 2025'!AT73","v":0},{"$f":"'Jan-Abr 2025'!AS73+'Mai-Ago 2025'!AS73+'Set-Dez 2025'!AS73+'Jan-Abr 2026'!AS73+'Mai-Ago 2026'!AS73+'Set-Dez 2026'!AS73+'Jan-Abr 2027'!AS73+'Mai-Ago 2027'!AS73","v":0},{"$nulls":3},0,{"$f":"IF($AK$4=$DB$8,BG73,IF($AK$4=$DB$9,BH73,IF($AK$4=$DB$10,BI73,IF($AK$4=$DB$11,BC73,IF($AK$4=$DB$12,BD73,IF($AK$4=$DB$13,BE73,IF($AK$4=$DB$14,BF73,\"\")))))))","v":0},0,null,{"$f":"COUNTIF($C$10:$AG$18,$AX73)","v":0},{"$f":"COUNTIF($C$22:$AG$30,$AX73)","v":0},{"$f":"COUNTIF($C$34:$AG$42,$AX73)","v":0},{"$f":"COUNTIF($C$46:$AG$54,$AX73)","v":0},{"$f":"SUM(BC73:BF73)","v":0},{"$f":"'Jan-Abr 2025'!BH73","v":0},{"$f":"'Jan-Abr 2025'!BG73+'Mai-Ago 2025'!BG73+'Set-Dez 2025'!BG73+'Jan-Abr 2026'!BG73+'Mai-Ago 2026'!BG73+'Set-Dez 2026'!BG73+'Jan-Abr 2027'!BG73+'Mai-Ago 2027'!BG73","v":0},{"$nulls":3},0,{"$f":"IF($AK$4=$DB$8,BU73,IF($AK$4=$DB$9,BV73,IF($AK$4=$DB$10,BW73,IF($AK$4=$DB$11,BQ73,IF($AK$4=$DB$12,BR73,IF($AK$4=$DB$13,BS73,IF($AK$4=$DB$14,BT73,\"\")))))))","v":0},0,null,{"$f":"COUNTIF($C$10:$AG$18,$BL73)","v":0},{"$f":"COUNTIF($C$22:$AG$30,$BL73)","v":0},{"$f":"COUNTIF($C$34:$AG$42,$BL73)","v":0},{"$f":"COUNTIF($C$46:$AG$54,$BL73)","v":0},0,{"$f":"'Jan-Abr 2025'!BV73","v":0},{"$f":"'Jan-Abr 2025'!BU73+'Mai-Ago 2025'!BU73+'Set-Dez 2025'!BU73+'Jan-Abr 2026'!BU73+'Mai-Ago 2026'!BU73+'Set-Dez 2026'!BU73+'Jan-Abr 2027'!BU73+'Mai-Ago 2027'!BU73","v":0}]
[null,6417,"SD","Sistemas Digitais",{"$nulls":5},"I159",50,{"$nulls":9},"Seg.","Ter.","Qua.","Qui.","Sex."]
[{"$nulls":19},"Salas:",{"$nulls":16},{"$f":"SUMIF(AI8:AI73,\"=M\",AK8:AK73)+SUMIF(AI8:AI73,\"=T\",AK8:AK73)","v":0},null,null,{"$f":"SUMIF(AI8:AI73,\"=M\",AN8:AN73)+SUMIF(AI8:AI73,\"=T\",AN8:AN73)","v":0},{"$nulls":10},{"$f":"SUMIF(AW8:AW73,\"=M\",AY8:AY73)+SUMIF(AW8:AW73,\"=T\",AY8:AY73)","v":0},null,null,{"$f":"SUMIF(AW8:AW73,\"=M\",BB8:BB73)+SUMIF(AW8:AW73,\"=T\",BB8:BB73)","v":0},{"$nulls":10},{"$f":"SUMIF(BK8:BK73,\"=M\",BM8:BM73)+SUMIF(BK8:BK73,\"=T\",BM8:BM73)","v":0},null,null,{"$f":"SUMIF(BK8:BK73,\"=M\",BP8:BP73)+SUMIF(BK8:BK73,\"=T\",BP8:BP73)","v":0}]
[{"$nulls":34},"Totais",null,{"$f":"AK75+AY75+BM75","v":0},null,null,{"$f":"AN75+BB75+BP75","v":0}]
["R. Quantitativas:"]